Dodecahydro-1H,6H,11H-tripyrido[1,2-a:1',2'-c:1",2"-e][1,3,5]triazine

Reaction thermochemistry data

Data compiled by: Hussein Y. Afeefy, Joel F. Liebman, and Stephen E. Stein

Individual Reactions

3Hydrogen + Dodecahydro-1H,6H,11H-tripyrido[1,2-a:1',2'-c:1",2"-e][1,3,5]triazine = 3Piperidine

By formula: 3H2 + C15H27N3 = 3C5H11N

Quantity Value Units Method Reference Comment
Δr-126. ± 2.kJ/molChydWiberg, Nakaji, et al., 1993liquid phase; solvent: Acetic acid

Gas phase ion energetics data

Data compiled by: Sharon G. Lias, John E. Bartmess, Joel F. Liebman, John L. Holmes, Rhoda D. Levin, and W. Gary Mallard

Ionization energy determinations

IE (eV) Method Reference Comment
7.6PEBeck, Hunig, et al., 1986
7.85PEBeck, Hunig, et al., 1986Vertical value

References

Wiberg, Nakaji, et al., 1993
Wiberg, K.B.; Nakaji, D.Y.; Morgan, K.M., Heat of hydrogenation of a cis imine. An experimental and theoretical study, J. Am. Chem. Soc., 1993, 115, 3527-3532. [all data]