(E)-3,5-Hexadien-1-yne

Reaction thermochemistry data

Data compiled by: Hussein Y. Afeefy, Joel F. Liebman, and Stephen E. Stein

Individual Reactions

(E)-3,5-Hexadien-1-yne = (Z)-3,5-Hexadien-1-yne

By formula: C6H6 = C6H6

Quantity Value Units Method Reference Comment
Δr0.4 ± 0.6kcal/molEqkRoth, Hopf, et al., 1994gas phase; At 623 K

References

Roth, Hopf, et al., 1994
Roth, W.R.; Hopf, H.; Horn, C., Propargyl-Stabilisierungsenergie, Chem. Ber., 1994, 127, 1781-1795. [all data]