N,2,2,2-tetrafluoro-N-[1,2,2,2-tetrafluoro-1-(trifluoromethyl)ethyl]-acetamide

Phase change data

Data compiled by: William E. Acree, Jr., James S. Chickos

Enthalpy of vaporization

ΔvapH (kJ/mol) Temperature (K) Reference
32.6332.Peterman and Shreeve, 1974

References

Peterman and Shreeve, 1974
Peterman, Keith E.; Shreeve, Jean'ne M., None, Inorg. Chem., 1974, 13, 11, 2705-2709, https://doi.org/10.1021/ic50141a031 . [all data]