Ethopropazine

Normal alkane RI, non-polar column, temperature ramp

Data compiled by: NIST Mass Spectrometry Data Center, William E. Wallace, director

Column type PackedPacked
Active phase SE-30OV-1
Column length (m) 2.2.
Carrier gas Nitrogen
Substrate Chromosorb G AW DMCS (80-100 mesh)Gas Chrom P
Column diameter (mm)
Phase thickness (μm)
Tstart (C) 100.120.
Tend (C) 300.200.
Heat rate (K/min)  2.5
Initial hold (min)
Final hold (min)
I 2357.2390.
ReferenceMHA, 9999Marozzi, Gambaro, et al., 1982
Comment MSDC-RI MSDC-RI

References

MHA, 9999
MHA, Directorate of ForensicScience., Forensic Toxicology, 9999. [all data]

Marozzi, Gambaro, et al., 1982
Marozzi, E.; Gambaro, V.; Saligari, E.; Mariani, R.; Lodi, F., Use of the retention index in gas chromatographic studies of drugs, J. Anal. Toxicol., 1982, 6, 4, 185-192, https://doi.org/10.1093/jat/6.4.185 . [all data]