Beryllium,bromo(η5-2,4-cyclopentadien-1-yl)-

Gas phase ion energetics data

Data compiled by: Sharon G. Lias, Rhoda D. Levin, and Sherif A. Kafafi

Ionization energy determinations

IE (eV) Method Reference Comment
9.52PEBohm, Gleiter, et al., 1980Vertical value

References

Bohm, Gleiter, et al., 1980
Bohm, M.C.; Gleiter, R.; Morgan, G.L.; Lusztyk, J.; Starowieyski, K.B., Electronic structure of metallocenes V. Photoelectron spectra of cyclopentadienyl-beryllium compounds, J. Organomet. Chem., 1980, 194, 257. [all data]