Cannabidiol

Van Den Dool and Kratz RI, non-polar column, custom temperature program

View large format table.

Column type Active phase I Reference Comment
CapillaryVF-5MS2441.3Tret'yakov, 200830. m/0.25 mm/0.25 μm, He; Program: Multi-step temperature program; T(initial)=60C; T(final)=270C

Normal alkane RI, non-polar column, isothermal

View large format table.

Column type Active phase Temperature (C) I Reference Comment
PackedOV-1180.2392.Gizella, Szabolcs, et al., 1995N2, Chromosorb WHP; Column length: 2.6 m
PackedSE-30200.2366.Lebbe, Lafarge, et al., 1972Nitrogen, Chromosorb (80-100 mesh); Column length: 1.2 m

Normal alkane RI, non-polar column, temperature ramp

View large format table.

Column type Active phase I Reference Comment
PackedOV-12365.Marozzi, Gambaro, et al., 1982Gas Chrom P, 5. K/min; Column length: 2. m; Tstart: 150. C; Tend: 300. C
PackedSE-302385.Marozzi, Gambaro, et al., 1982Gas Chrom P, 5. K/min; Column length: 2. m; Tstart: 150. C; Tend: 300. C

Normal alkane RI, non-polar column, custom temperature program

View large format table.

Column type Active phase I Reference Comment
CapillaryPolydimethyl siloxanes2383.Schutz and Wollrab A., 1988Program: not specified
OtherMethyl Silicone2383.Ardrey and Moffat, 1981Program: not specified

References

Tret'yakov, 2008
Tret'yakov, K.V., Retention Data. NIST Mass Spectrometry Data Center., NIST Mass Spectrometry Data Center, 2008. [all data]

Gizella, Szabolcs, et al., 1995
Gizella, P.; Szabolcs, N.; Peep, V.; György, O.P.T., Kannabinoidok gázkromatográfiás vizsgálata tandem oszlopokon, Acta Pharm. Hung., 1995, 65, 63-67. [all data]

Lebbe, Lafarge, et al., 1972
Lebbe, J.; Lafarge, J.-P.; Laplace, M., Utilization of gas chromatography in toxicological investigations. I. Characterization of Cannabis sativa, Annales des falsifications et de l'expertise chimique, 1972, 65, 705, 410-417. [all data]

Marozzi, Gambaro, et al., 1982
Marozzi, E.; Gambaro, V.; Saligari, E.; Mariani, R.; Lodi, F., Use of the retention index in gas chromatographic studies of drugs, J. Anal. Toxicol., 1982, 6, 4, 185-192, https://doi.org/10.1093/jat/6.4.185 . [all data]

Schutz and Wollrab A., 1988
Schutz, H.; Wollrab A., The significance of the retention index in toxicologic analysis II, Pharmazie in unzerer Zeit, 1988, 17, 4, 97-101. [all data]

Ardrey and Moffat, 1981
Ardrey, R.E.; Moffat, A.C., Gas-liquid chromatographic retention indices of 1318 substances of toxicological interest on SE-30 or OV-1 stationary phase, J. Chromatogr., 1981, 220, 3, 195-252, https://doi.org/10.1016/S0021-9673(00)81925-1 . [all data]