Cannabinol

Phase change data

Data compiled by: William E. Acree, Jr., James S. Chickos

Enthalpy of fusion

ΔfusH (kJ/mol) Temperature (K) Reference
17.352.2Stinchcomb, Valiveti, et al., 2004

Van Den Dool and Kratz RI, non-polar column, temperature ramp

View large format table.

Column type Active phase I Reference Comment
CapillaryDB-12538.Perrigo, Peel, et al., 198515. m/0.32 mm/0.25 μm, He, 8. K/min, 280. C @ 5. min; Tstart: 120. C

Van Den Dool and Kratz RI, non-polar column, custom temperature program

View large format table.

Column type Active phase I Reference Comment
CapillaryVF-5MS2612.Tret'yakov, 200830. m/0.25 mm/0.25 μm, He; Program: Multi-step temperature program; T(initial)=60C; T(final)=270C

Normal alkane RI, non-polar column, isothermal

View large format table.

Column type Active phase Temperature (C) I Reference Comment
PackedOV-1180.2495.Gizella, Szabolcs, et al., 1995N2, Chromosorb WHP; Column length: 2.6 m
PackedSE-30200.2516.Lebbe, Lafarge, et al., 1972Nitrogen, Chromosorb (80-100 mesh); Column length: 1.2 m

Normal alkane RI, non-polar column, temperature ramp

View large format table.

Column type Active phase I Reference Comment
PackedOV-12525.Marozzi, Gambaro, et al., 1982Gas Chrom P, 5. K/min; Column length: 2. m; Tstart: 150. C; Tend: 300. C
PackedSE-302535.Marozzi, Gambaro, et al., 1982Gas Chrom P, 5. K/min; Column length: 2. m; Tstart: 150. C; Tend: 300. C

Normal alkane RI, non-polar column, custom temperature program

View large format table.

Column type Active phase I Reference Comment
OtherMethyl Silicone2520.Ardrey and Moffat, 1981Program: not specified

References

Stinchcomb, Valiveti, et al., 2004
Stinchcomb, Audra L.; Valiveti, Satyanarayana; Hammell, Dana C.; Ramsey, Diana R., Human skin permeation of Δ8-tetrahydrocannabinol, cannabidiol and cannabinol, j pharm pharmacol, 2004, 56, 3, 291-297, https://doi.org/10.1211/0022357022791 . [all data]

Perrigo, Peel, et al., 1985
Perrigo, B.J.; Peel, H.W.; Ballantyne, D.J., Use of Dual-Column Fused-Silica Capillary Gas Chromatography in Combination with Detector Response Factors for Analytical Toxicology., J. Chromatogr., 1985, 341, 81-88, https://doi.org/10.1016/S0378-4347(00)84011-6 . [all data]

Tret'yakov, 2008
Tret'yakov, K.V., Retention Data. NIST Mass Spectrometry Data Center., NIST Mass Spectrometry Data Center, 2008. [all data]

Gizella, Szabolcs, et al., 1995
Gizella, P.; Szabolcs, N.; Peep, V.; György, O.P.T., Kannabinoidok gázkromatográfiás vizsgálata tandem oszlopokon, Acta Pharm. Hung., 1995, 65, 63-67. [all data]

Lebbe, Lafarge, et al., 1972
Lebbe, J.; Lafarge, J.-P.; Laplace, M., Utilization of gas chromatography in toxicological investigations. I. Characterization of Cannabis sativa, Annales des falsifications et de l'expertise chimique, 1972, 65, 705, 410-417. [all data]

Marozzi, Gambaro, et al., 1982
Marozzi, E.; Gambaro, V.; Saligari, E.; Mariani, R.; Lodi, F., Use of the retention index in gas chromatographic studies of drugs, J. Anal. Toxicol., 1982, 6, 4, 185-192, https://doi.org/10.1093/jat/6.4.185 . [all data]

Ardrey and Moffat, 1981
Ardrey, R.E.; Moffat, A.C., Gas-liquid chromatographic retention indices of 1318 substances of toxicological interest on SE-30 or OV-1 stationary phase, J. Chromatogr., 1981, 220, 3, 195-252, https://doi.org/10.1016/S0021-9673(00)81925-1 . [all data]