m-Cymen-8-ol

Normal alkane RI, non-polar column, temperature ramp

Data compiled by: NIST Mass Spectrometry Data Center, William E. Wallace, director

Column type CapillaryCapillaryCapillaryCapillaryCapillary
Active phase DB-5ZB-55 % Phenyl methyl siloxaneDB-1HP-5
Column length (m) 30.30.30.30.30.
Carrier gas Helium HeliumHeHe
Substrate
Column diameter (mm) 0.250.250.250.250.25
Phase thickness (μm) 0.250.250.250.250.25
Tstart (C) 45.60.60.50.60.
Tend (C) 250.220.280.265.280.
Heat rate (K/min) 3.4.3.2.53.
Initial hold (min) 3.5. 1.
Final hold (min) 5.20.30.30.
I 1185.1180.1153.1155.1169.
ReferencePorto, Decorti, et al., 2009Mohottalage, Tabacchi, et al., 2007Marongiu, Piras, et al., 2006Khalighi-Sigaroodi, Hadijiakhoondi, et al., 2005Pitarokili, Tzakou, et al., 2003
Comment MSDC-RI MSDC-RI MSDC-RI MSDC-RI MSDC-RI
Column type CapillaryCapillary
Active phase DB-1SE-54
Column length (m) 50.30.
Carrier gas N2Hydrogen
Substrate
Column diameter (mm) 0.250.25
Phase thickness (μm) 0.250.25
Tstart (C) 80.60.
Tend (C) 225.250.
Heat rate (K/min) 4.2.
Initial hold (min)  5.
Final hold (min)  2.
I 1155.1180.
ReferencePalá-Paúl, Pérez-Alonso, et al., 2002Kollmannsberger, Nitz, et al., 1992
Comment MSDC-RI MSDC-RI

References

Porto, Decorti, et al., 2009
Porto, C.Da.; Decorti, D.; Kikic, I., Flavour compounds of Lavandula angustifolia L. to use in food manufacturing: comparison of three different extraction methods, Food Chem., 2009, 112, 4, 1072-1078, https://doi.org/10.1016/j.foodchem.2008.07.015 . [all data]

Mohottalage, Tabacchi, et al., 2007
Mohottalage, S.; Tabacchi, R.; Guerin, P.M., Components from Sri Lankan Piper betle L. leaf oil and their analogues showing toxicity against the housefly, Musca domestica, Flavour Fragr. J., 2007, 22, 2, 130-138, https://doi.org/10.1002/ffj.1770 . [all data]

Marongiu, Piras, et al., 2006
Marongiu, B.; Piras, A.; Porcedda, S.; Tuveri, E.; Maxia, A., Isolation of Seseli bocconi Guss. volatile oil by supercritical carbon dioxide extraction, Natural Product Research, 2006, 20, 9, 820-826, https://doi.org/10.1080/14786410500364684 . [all data]

Khalighi-Sigaroodi, Hadijiakhoondi, et al., 2005
Khalighi-Sigaroodi, F.; Hadijiakhoondi, A.; Shahverdi, A.R.; Mozaffarian, V.-A.; Shafiee, A., Chemical composition and antimicrobial activity of the essential oil of Ferulago Bernardii Tomk. and M.Pimen., DARU, 2005, 13, 3, 100-104. [all data]

Pitarokili, Tzakou, et al., 2003
Pitarokili, D.; Tzakou, O.; Loukis, A.; Harvala, C., Volatile metabolites from Salvia fruticosa as antifungal agents in soilborne pathogens, J. Agric. Food Chem., 2003, 51, 11, 3294-3301, https://doi.org/10.1021/jf0211534 . [all data]

Palá-Paúl, Pérez-Alonso, et al., 2002
Palá-Paúl, J.; Pérez-Alonso, M.J.; Velasco-Negueruela, A.; Sanz, J., Analysis by gas chromatography-mass spectrometry of the volatile components of Ageratina adenophora Spreng., growing in the Canary Islands, J. Chromatogr. A, 2002, 947, 2, 327-331, https://doi.org/10.1016/S0021-9673(02)00016-X . [all data]

Kollmannsberger, Nitz, et al., 1992
Kollmannsberger, H.; Nitz, S.; Drawert, F., UBer die Aromastoffzusammensetzung von Hochdruckextrakten. I. Pfeffer (Piper nigrum, Var. muntok), Z. Lebensm. Unters Forsch., 1992, 194, 6, 545-551, https://doi.org/10.1007/BF01185481 . [all data]