5-Decanol

Condensed phase thermochemistry data

Data compiled by: Eugene S. Domalski and Elizabeth D. Hearing

Constant pressure heat capacity of liquid

Cp,liquid (cal/mol*K) Temperature (K) Reference
96.981298.15Caceres-Alonso, Costas, et al., 1988

Phase change data

Data compiled as indicated in comments:
TRC - Thermodynamics Research Center, NIST Boulder Laboratories, Chris Muzny director

Quantity Value Units Method Reference Comment
Tc663. ± 1.KN/AGude and Teja, 1995
Tc663.2KN/ATeja, Lee, et al., 1989TRC
Tc663.23KN/AAnselme and Teja, 1988Uncertainty assigned by TRC = 0.3 K; TRC
Quantity Value Units Method Reference Comment
Vc0.646l/molN/AGude and Teja, 1995
Quantity Value Units Method Reference Comment
ρc1.55mol/lN/AGude and Teja, 1995
ρc1.55mol/lN/AAnselme and Teja, 1988Uncertainty assigned by TRC = 0.04 mol/l; TRC

In addition to the Thermodynamics Research Center (TRC) data available from this site, much more physical and chemical property data is available from the following TRC products:

Kovats' RI, non-polar column, isothermal

Data compiled by: NIST Mass Spectrometry Data Center, William E. Wallace, director

Column type Packed
Active phase SE-30
Column length (m) 3.0
Carrier gas
Substrate
Column diameter (mm)
Phase thickness (μm)
Temperature (C) 150.
I 1181.
ReferenceBierl, Beroza, et al., 1972
Comment MSDC-RI

References

Caceres-Alonso, Costas, et al., 1988
Caceres-Alonso, M.; Costas, M.; Andreoli-Ball, L.; Patterson, D., Steric effects on the self-association of branched and cyclic alcohols in inert solvents. Apparent heat capacities of secondary and tertiary alcohols in hydrocarbons, Can. J. Chem., 1988, 66, 989-998. [all data]

Gude and Teja, 1995
Gude, M.; Teja, A.S., Vapor-Liquid Critical Properties of Elements and Compounds. 4. Aliphatic Alkanols, J. Chem. Eng. Data, 1995, 40, 1025-1036. [all data]

Teja, Lee, et al., 1989
Teja, A.S.; Lee, R.J.; Rosenthal, D.J.; Anselme, M.J., Correlation of the Critical Properties of Alkanes and Alkanols in 5th IUPAC Conference on Alkanes and AlkanolsGradisca, 1989. [all data]

Anselme and Teja, 1988
Anselme, M.J.; Teja, A.S., Critical Temperatures and Densities of Isomeric Alkanols with Six to Ten Carbon Atoms, Fluid Phase Equilib., 1988, 40, 127-34. [all data]