4-Pentenal, 2-ethyl-

Normal alkane RI, non-polar column, temperature ramp

Data compiled by: NIST Mass Spectrometry Data Center, William E. Wallace, director

Column type CapillaryCapillaryCapillary
Active phase DB-5DB-5DB-5
Column length (m) 30.30.30.
Carrier gas HeHeliumHelium
Substrate
Column diameter (mm) 0.260.260.26
Phase thickness (μm) 0.250.250.25
Tstart (C) 60.60.60.
Tend (C) 240.290.290.
Heat rate (K/min) 3.3.3.
Initial hold (min)
Final hold (min)
I 1034.1034.1034.
ReferenceBos, Woerdenbag, et al., 2007Elfami, Bos, et al., 2007Elfami, Komar, et al., 2006
Comment MSDC-RI MSDC-RI MSDC-RI

References

Bos, Woerdenbag, et al., 2007
Bos, R.; Woerdenbag, H.J.; Kayser, O.; Quax, W.J.; Ruslan, K.; Elfami, Essential oil constituents of Piper cubeba L. fils. from Indonesia, J. Essent. Oil Res., 2007, 19, 1, 14-17, https://doi.org/10.1080/10412905.2007.9699217 . [all data]

Elfami, Bos, et al., 2007
Elfami; Bos, R.; Ruslan, K.; Woerdenbag, H.J.; Kayser, P.; Quax, W.J., Essential Oil Constituents of Piper cubeba from Indonesia, 2007, 53-60. [all data]

Elfami, Komar, et al., 2006
Elfami, R.B.; Komar, R.; Woerdenbag, H.J.; Kayser, P.; Quax, W.J., Essential oil constituents of Piper cubeba from Indonesia, 2006, retrieved from http://dissertations.ub.rug.nl/FILES/facultiew/science/2006/elfahmi/05c5.pdf. [all data]