Dehydroacetic Acid

Phase change data

Data compiled as indicated in comments:
BS - Robert L. Brown and Stephen E. Stein
AC - William E. Acree, Jr., James S. Chickos

Quantity Value Units Method Reference Comment
Tboil543.2KN/AWeast and Grasselli, 1989BS

Enthalpy of vaporization

ΔvapH (kcal/mol) Temperature (K) Method Reference Comment
14.8379.AStephenson and Malanowski, 1987Based on data from 364. - 542. K. See also Stull, 1947.; AC

Antoine Equation Parameters

log10(P) = A − (B / (T + C))
    P = vapor pressure (atm)
    T = temperature (K)

View plot Requires a JavaScript / HTML 5 canvas capable browser.

Temperature (K) A B C Reference Comment
364.8 - 542.5.174702571.402-45.659Stull, 1947Coefficents calculated by NIST from author's data.

Reaction thermochemistry data

Data compiled by: Hussein Y. Afeefy, Joel F. Liebman, and Stephen E. Stein

Individual Reactions

22-Oxetanone, 4-methylene- = Dehydroacetic Acid

By formula: 2C4H4O2 = C8H8O4

Quantity Value Units Method Reference Comment
Δr-22.0kcal/molKinLopatin, Popov, et al., 1992liquid phase; solvent: Solution

References

Weast and Grasselli, 1989
CRC Handbook of Data on Organic Compounds, 2nd Editon, Weast,R.C and Grasselli, J.G., ed(s)., CRC Press, Inc., Boca Raton, FL, 1989, 1. [all data]

Stephenson and Malanowski, 1987
Stephenson, Richard M.; Malanowski, Stanislaw, Handbook of the Thermodynamics of Organic Compounds, 1987, https://doi.org/10.1007/978-94-009-3173-2 . [all data]

Stull, 1947
Stull, Daniel R., Vapor Pressure of Pure Substances. Organic and Inorganic Compounds, Ind. Eng. Chem., 1947, 39, 4, 517-540, https://doi.org/10.1021/ie50448a022 . [all data]

Lopatin, Popov, et al., 1992
Lopatin, E.B.; Popov, V.V.; Epshtein, N.A.; Mikhaleva, L.M.; Makarov, Yu.N., Kinetic and thermochemical characteristics of diketene-based reactions, Khim.-Farm. Zh., 1992, 26, 76-78. [all data]

Berson, 1952
Berson, J.A., J. Am. Chem. Soc., 1952, 74, 5172. [all data]