GeAl3

Gas phase ion energetics data

Data compiled by: John E. Bartmess

Electron affinity determinations

EA (eV) Method Reference Comment
2.700 ± 0.090LPESLi, Zhang, et al., 2001Stated electron affinity is the Vertical Detachment Energy

References

Li, Zhang, et al., 2001
Li, X.; Zhang, H.-F.; Wang, L.-S.; Kuznetsov, A.E.; Cannon, N.A.; Boldyrev, A.I., Experimental and Theoretical Observations of Aromaticity in Heterocyclic XAl3- (X = Si, Ge, Sn, Pb) Systems, Angew. Chem. Intl. Ed. Engl., 2001, 40, 10, 1867, https://doi.org/10.1002/1521-3773(20010518)40:10<1867::AID-ANIE1867>3.0.CO;2-W . [all data]