C5O2

Phase change data

Data compiled by: William E. Acree, Jr., James S. Chickos

Enthalpy of vaporization

ΔvapH (kcal/mol) Temperature (K) Method Reference Comment
1.1258.AStephenson and Malanowski, 1987Based on data from 186. - 273. K. See also Klemenc and Wagner, 2006.

References

Stephenson and Malanowski, 1987
Stephenson, Richard M.; Malanowski, Stanislaw, Handbook of the Thermodynamics of Organic Compounds, 1987, https://doi.org/10.1007/978-94-009-3173-2 . [all data]

Klemenc and Wagner, 2006
Klemenc, Alfons; Wagner, Georg, Pentacarbondioxyd, O:C:C:C:C:C:O, Ber. dtsch. Chem. Ges. A/B, 2006, 70, 9, 1880-1882, https://doi.org/10.1002/cber.19370700909 . [all data]