Gallium difluoride

Gas phase ion energetics data

Data compiled by: Henry M. Rosenstock, Keith Draxl, Bruce W. Steiner, and John T. Herron

Ionization energy determinations

IE (eV) Method Reference
13.3 ± 0.5EIZmbov and Margrave, 1967

References

Zmbov and Margrave, 1967
Zmbov, K.F.; Margrave, J.L., Mass spectrometric studies at high temperatures. XXI. The heat of atomization of galium oxyfluoride, J. Inorg. Nucl. Chem., 1967, 29, 2649. [all data]