3-Mercaptohexanol

Normal alkane RI, polar column, custom temperature program

Data compiled by: NIST Mass Spectrometry Data Center, William E. Wallace, director

Column type CapillaryCapillaryCapillaryCapillaryCapillary
Active phase FFAPFFAPFFAPFFAP-CBFFAP
Column length (m) 25.25.25.25.25.
Carrier gas NitrogenNitrogenNitrogenHeliumHe
Substrate
Column diameter (mm) 0.320.320.320.320.32
Phase thickness (μm) 0.300.300.300.300.3
Program 36 0C 20 0C/min -> 85 0C 1 0C/min -> 145 0C 3 0C/min -> 250 0C (30 min)36 0C 20 0C/min -> 85 0C 1 0C/min -> 145 0C 3 0C/min -> 250 0C36 0C 20 0C/min -> 85 0C 1 0C -> 145 0C 3 0C/min -> 230 0C36 0C 20 0C/min -> 85 0C 1 0C/min -> 1345 0C 3 0C/min -> 250 0C36C => 20C/min => 85C => 1C/min => 145C => 3C/min => 250C
I 1858.1853.1853.1853.1853.
ReferenceGros, Nizet, et al., 2011Bailly and Collin, 2010Bailly, Jerkovic, et al., 2009Bailly, Jerkovic, et al., 2006Bailly, Jerkovic, et al., 2006, 2
Comment MSDC-RI MSDC-RI MSDC-RI MSDC-RI MSDC-RI
Column type CapillaryCapillaryCapillary
Active phase FFAPCP-WAX 57CBFFAP
Column length (m) 25.50.25.
Carrier gas  He
Substrate
Column diameter (mm) 0.320.250.32
Phase thickness (μm) 0.30.20.3
Program 40C(4min) => 2C/min => 132C => 10C/min => 250C (15min)40C(10min) => 5C/min => 100C => 3C/min => 180C => 20C/min => 210C (10min)40C(4min) => 2C/min => 132C => 10C/min => 250C(15min)
I 1853.1871.1853.
ReferenceVermeulen, Lejeune, et al., 2006Martí, Mestres, et al., 2003Vermeulen, Guyot-Declerck, et al., 2003
Comment MSDC-RI MSDC-RI MSDC-RI

References

Gros, Nizet, et al., 2011
Gros, J.; Nizet, S.; Collin, S., Occurence of odorant polyfunctional thiols in the Super Alpha Tomahawk Hop cultivar. Comparison with the thiol-rich Nelson Sauvin bitter variety, J. Agric. Food Chem., 2011, 59, 16, 8853-8865, https://doi.org/10.1021/jf201294e . [all data]

Bailly and Collin, 2010
Bailly, S.; Collin, S., Fate of polyunsaturated thiols in sauternes wines through ageing in Expression of Multidisciplinary Flavour Sci., Blank, I.; Wust, M.; Yertzian, C., ed(s)., Zhaw Ed., 2010, 227-230, retrieved from https://home.zhaw.ch/tildayere/pdf/Teil58-Expression of Multidisciplinary.pdf. [all data]

Bailly, Jerkovic, et al., 2009
Bailly, S.; Jerkovic, V.; Meuree, A.; Timmermans, A.; Collin, S., Fate of key odorants in Sauternes wines through aging, J. Agric. Food Chem., 2009, 57, 18, 8557-8563, https://doi.org/10.1021/jf901429d . [all data]

Bailly, Jerkovic, et al., 2006
Bailly, S.; Jerkovic, V.; Collin, S., Identification of key-odorants in Sauternes wines, Identification of key-odorants in Sauternes wines, 5th International Terroir Congress, 2006, 4. [all data]

Bailly, Jerkovic, et al., 2006, 2
Bailly, S.; Jerkovic, V.; Marchand-Brynaert, J.; Collin, S., Aroma Extraction Dilution Analysis of Sauternes Wines. Key Role of Polyfunctional Thiols, J. Agric. Food Chem., 2006, 54, 19, 7227-7234, https://doi.org/10.1021/jf060814k . [all data]

Vermeulen, Lejeune, et al., 2006
Vermeulen, C.; Lejeune, I.; Tran, T.T.H.; Collin, S., Occurrence of polyfunctional thiols in fresh lager beers, J. Agric. Food Chem., 2006, 54, 14, 5061-5068, https://doi.org/10.1021/jf060669a . [all data]

Martí, Mestres, et al., 2003
Martí, M.P.; Mestres, M.; Sala, C.; Busto, O.; Guasch, J., Solid-phase microextraction and gas chromatography olfactometry analysis of successively diluted samples. A new approach of the aroma extract dilution analysis applied to the characterization of wine aroma, J. Agric. Food Chem., 2003, 51, 27, 7861-7865, https://doi.org/10.1021/jf0345604 . [all data]

Vermeulen, Guyot-Declerck, et al., 2003
Vermeulen, C.; Guyot-Declerck, C.; Collin, S., Combinatorial synthesis and sensorial properties of mercapto primary alcohols and analogues, J. Agric. Food Chem., 2003, 51, 12, 3623-3628, https://doi.org/10.1021/jf0212340 . [all data]