3-(methylthio) hexanol

Van Den Dool and Kratz RI, non-polar column, temperature ramp

Data compiled by: NIST Mass Spectrometry Data Center, William E. Wallace, director

Column type Capillary
Active phase HP-5
Column length (m) 30.
Carrier gas He
Substrate
Column diameter (mm) 0.25
Phase thickness (μm) 0.25
Tstart (C) 50.
Tend (C) 290.
Heat rate (K/min) 4.
Initial hold (min)
Final hold (min)
I 1203.
ReferenceFlach A., Dondon R.C., et al., 2004
Comment MSDC-RI

Normal alkane RI, polar column, temperature ramp

Data compiled by: NIST Mass Spectrometry Data Center, William E. Wallace, director

Column type CapillaryCapillary
Active phase DB-WaxDB-Wax
Column length (m) 60.60.
Carrier gas H2He
Substrate
Column diameter (mm) 0.320.32
Phase thickness (μm) 0.25
Tstart (C) 60.70.
Tend (C) 220.230.
Heat rate (K/min) 3.2.
Initial hold (min)
Final hold (min)
I 1878.1843.
ReferenceWerkhoff, Güntert, et al., 1998Engel and Tressl, 1991
Comment MSDC-RI MSDC-RI

References

Flach A., Dondon R.C., et al., 2004
Flach A.; Dondon R.C.; Singer R.B.; Koehler S.; Amaral M.D.E.; Marsaioli A.J., The chemistry of pollination in selected Brazilian maxillariinae orchids: Floral rewards and fragrance, J. Chem. Ecol., 2004, 30, 5, 1045-1056, https://doi.org/10.1023/B:JOEC.0000028466.50392.ed . [all data]