Pentafluoropropionic fluorosulfuric acid anhydride

Phase change data

Data compiled by: William E. Acree, Jr., James S. Chickos

Enthalpy of vaporization

ΔvapH (kcal/mol) Temperature (K) Method Reference Comment
9.37267.AStephenson and Malanowski, 1987Based on data from 252. - 335. K. See also DesMarteau and Cady, 1966.

References

Stephenson and Malanowski, 1987
Stephenson, Richard M.; Malanowski, Stanislaw, Handbook of the Thermodynamics of Organic Compounds, 1987, https://doi.org/10.1007/978-94-009-3173-2 . [all data]

DesMarteau and Cady, 1966
DesMarteau, Darryl D.; Cady, George H., The Reaction of Peroxydisulfuryl Difluoride with Anhydrides of Certain Perhalocarboxylic Acids to Form Perhaloacyl Fluorosulfates, Inorg. Chem., 1966, 5, 2, 169-171, https://doi.org/10.1021/ic50036a001 . [all data]