Ergosta-5,7,9(11),22-tetraen-3-ol, (3β,22E)-

Van Den Dool and Kratz RI, non-polar column, custom temperature program

View large format table.

Column type Active phase I Reference Comment
CapillaryHP-5MS3214.9Andriamaharavo, 201430. m/0.25 mm/0.25 μm, He; Program: 60C (1 min) => 5 C/min => 210C => 10 C/min => 280C (15 min)

Normal alkane RI, non-polar column, temperature ramp

View large format table.

Column type Active phase I Reference Comment
CapillaryDB-5 MS3150.Radulovic and Dordevic, 201130. m/0.25 mm/0.25 μm, Helium, 5. K/min, 315. C @ 10. min; Tstart: 70. C

References

Andriamaharavo, 2014
Andriamaharavo, N.R., Retention Data. NIST Mass Spectrometry Data Center., NIST Mass Spectrometry Data Center, 2014. [all data]

Radulovic and Dordevic, 2011
Radulovic, N.S.; Dordevic, N.D., Sterods from poison hemlock (Conium maculatum L.): a GC-MS analysis, J. Serb. Chem. Soc., 2011, 76, 11, 1471-1483, https://doi.org/10.2298/JSC110206128R . [all data]