Ditin disulfide

Gas phase ion energetics data

Data compiled by: Henry M. Rosenstock, Keith Draxl, Bruce W. Steiner, and John T. Herron

Ionization energy determinations

IE (eV) Method Reference
9.4 ± 0.5EIColin and Drowart, 1962

Appearance energy determinations

Ion AE (eV) Other Products MethodReferenceComment
Sn2S+12.4 ± 1.0SEIColin and Drowart, 1962
Sn2+16.5 ± 1.0?EIColin and Drowart, 1962

References

Colin and Drowart, 1962
Colin, R.; Drowart, J., Thermodynamic study of tin sulfide and lead sulfide using a mass spectrometer, J. Chem. Phys., 1962, 37, 1120. [all data]