As3

Vibrational and/or electronic energy levels

Data compiled by: Marilyn E. Jacox

State:   A

 Energy
 (cm-1
 Med.   Transition   λmin
 (nm)
 λmax
 (nm)

References

Txx = 2900 T gas Lippa, Xu, et al., 1998

Additional references: Jacox, 2003, page 127

Lippa, Xu, et al., 1998
Lippa, T.P.; Xu, S.-J.; Lyapustina, S.A.; Nilles, J.M.; Bowen, K.H., Photoelectron spectroscopy of As[sup -], As[sub 2][sup -], As[sub 3][sup -], As[sub 4][sup -], and As[sub 5][sup -], J. Chem. Phys., 1998, 109, 24, 10727, https://doi.org/10.1063/1.477771 . [all data]

Jacox, 2003
Jacox, M.E., Vibrational and electronic energy levels of polyatomic transient molecules: supplement B, J. Phys. Chem. Ref. Data, 2003, 32, 1, 1-441, https://doi.org/10.1063/1.1497629 . [all data]