Amidogen, methylene-d2

Gas phase ion energetics data

Data compiled by: Sharon G. Lias and Joel F. Liebman

Ionization energy determinations

IE (eV) Method Reference
9.4 ± 0.1PINesbitt, Marston, et al., 1991

References

Nesbitt, Marston, et al., 1991
Nesbitt, F.L.; Marston, G.; Stief, L.J.; Wickramaaratchi, M.A.; Tao, W.; Klemm, R.B., Measurement of the photoionization spectra and ionization thresholds of the H2CN and D2CN radicals, J. Phys. Chem., 1991, 95, 7613. [all data]