2-Ketoisovaleric acid oxime, bis(trimethylsilyl)- deriv.

Van Den Dool and Kratz RI, non-polar column, temperature ramp

Data compiled by: NIST Mass Spectrometry Data Center, William E. Wallace, director

Column type CapillaryCapillaryCapillaryCapillaryPacked
Active phase DB-5OV-1SE-52CP Sil 5 CBOV-1
Column length (m) 30.10.25. 1.8
Carrier gas HeHeHeN2N2
Substrate     100-120 mesh
Column diameter (mm) 0.250.220.32
Phase thickness (μm) 1.0.170.52
Tstart (C) 100.70.70.60.70.
Tend (C) 290.270.270.280.290.
Heat rate (K/min) 4.5.5.6.28.
Initial hold (min) 4.  0.50.5
Final hold (min) 10.  5.
I 1214.1224.1224.1214.1213.
ReferenceKimura, Yamamoto, et al., 1999Lefevere, Verhaeghe, et al., 1989Lefevere, Verhaeghe, et al., 1989Wurth, Kumps, et al., 1989Tanaka, Hine, et al., 1980
Comment MSDC-RI MSDC-RI MSDC-RI MSDC-RI MSDC-RI

References

Kimura, Yamamoto, et al., 1999
Kimura, M.; Yamamoto, T.; Yamaguchi, S., Automated metabolic profiling and interpretation of GC/MS data for organic acidemia screening: a personal computer-based system, Tohoku J. Exp. Med., 1999, 188, 4, 317-334, https://doi.org/10.1620/tjem.188.317 . [all data]

Lefevere, Verhaeghe, et al., 1989
Lefevere, M.F.; Verhaeghe, B.J.; Declerck, D.H.; Van Bocxlaer, J.F.; De Leenheer, A.P.; De Sagher, R.M., Metabolic Profiling of Urinary Organic Acids by Single and Multicolumn Capillary Gas Chromatography, J. Chromatogr. Sci., 1989, 27, 1, 23-29, https://doi.org/10.1093/chromsci/27.1.23 . [all data]

Wurth, Kumps, et al., 1989
Wurth, C.; Kumps, A.; Mardens, Y., Urinary organic acids: Retention indices on two capillary gas chromatography columns, J. Chromatogr., 1989, 491, 186-192, https://doi.org/10.1016/S0378-4347(00)82831-5 . [all data]

Tanaka, Hine, et al., 1980
Tanaka, K.; Hine, D.G.; West-Dull, A.; Lynn, T.B., Gas-chromatographic method of analysis for urinary organic acids. I. Retention indices of 155 metabolically important compounds, Clin. Chem., 1980, 26, 13, 1839-1846. [all data]