Tungsten trifluoride

Gas phase ion energetics data

Data compiled as indicated in comments:
LLK - Sharon G. Lias, Rhoda D. Levin, and Sherif A. Kafafi

Ionization energy determinations

IE (eV) Method Reference Comment
9.0 ± 0.2EIHildenbrand, 1975LLK

References

Hildenbrand, 1975
Hildenbrand, D.L., Thermochemistry of the gaseous tungsten fluorides, Chem. Phys. Lett., 1975, 62, 3074. [all data]