Thiophene, tetrahydro-2,5-dimethyl-, trans-

Phase change data

Data compiled by: William E. Acree, Jr., James S. Chickos

Enthalpy of vaporization

ΔvapH (kJ/mol) Temperature (K) Method Reference Comment
39.3363.EBStephenson and Malanowski, 1987Based on data from 348. - 396. K. See also White, Barnard--Smith, et al., 1952 and Dykyj, Svoboda, et al., 1999.

Kovats' RI, non-polar column, isothermal

View large format table.

Column type Active phase Temperature (C) I Reference Comment
CapillaryOV-101100.881.Gal'pern, Gollandskikh, et al., 1976H2; Column length: 100. m; Column diameter: 0.25 mm

Normal alkane RI, non-polar column, temperature ramp

View large format table.

Column type Active phase I Reference Comment
CapillaryCP-Sil 5865.Damste, van Dalen, et al., 198825. m/0.32 mm/0.45 μm, Helium, 0. C @ 5. min, 3. K/min; Tend: 300. C
CapillaryCP-Sil 5866.Damste, van Dalen, et al., 198825. m/0.32 mm/0.45 μm, Helium, 0. C @ 5. min, 3. K/min; Tend: 300. C
CapillaryCP Sil 5 CB866.Damste, Kock-van Dalen, et al., 198825. m/0.32 mm/0.45 μm, He, 3. K/min; Tstart: 50. C; Tend: 300. C

Normal alkane RI, non-polar column, custom temperature program

View large format table.

Column type Active phase I Reference Comment
CapillaryMethyl Silicone876.Farkas, Héberger, et al., 2004Program: not specified
CapillarySE-52890.van Langenhove and Schamp, 1986Column length: 100. m; Column diameter: 0.50 mm; Program: not specified

References

Stephenson and Malanowski, 1987
Stephenson, Richard M.; Malanowski, Stanislaw, Handbook of the Thermodynamics of Organic Compounds, 1987, https://doi.org/10.1007/978-94-009-3173-2 . [all data]

White, Barnard--Smith, et al., 1952
White, P.T.; Barnard--Smith, D.G.; Fidler, F.A., Vapor Pressure--Temperature Relationships of Sulfur Compounds Related to Petroleum, Ind. Eng. Chem., 1952, 44, 6, 1430-1438, https://doi.org/10.1021/ie50510a064 . [all data]

Dykyj, Svoboda, et al., 1999
Dykyj, J.; Svoboda, J.; Wilhoit, R.C.; Frenkel, M.L.; Hall, K.R., Vapor Pressure of Chemicals: Part A. Vapor Pressure and Antoine Constants for Hydrocarbons and Sulfur, Selenium, Tellurium and Hydrogen Containing Organic Compounds, Springer, Berlin, 1999, 373. [all data]

Gal'pern, Gollandskikh, et al., 1976
Gal'pern, G.D.; Gollandskikh, N.I.; Gordadze, G.N., Application of methylene-insertion reactions to cyclic sulphides (C4H8S, C5H10S and C6H12S) to produce standard compounds for gas chromatography, J. Chromatogr., 1976, 124, 1, 43-51, https://doi.org/10.1016/S0021-9673(00)87835-8 . [all data]

Damste, van Dalen, et al., 1988
Damste, J.S.S.; van Dalen, A.C.K.; de Leeuw, J.W.; Schenck, P.A., Identification of homologous series of alkylated thiophenes, thiolanes, thianes and benzothiophenes present in pyrolisates of sulfur-rich kerogenes, J. Chromatogr., 1988, 435, 435-452, https://doi.org/10.1016/S0021-9673(01)82208-1 . [all data]

Damste, Kock-van Dalen, et al., 1988
Damste, J.S.S.; Kock-van Dalen, A.C.; de Leeuw, J.W.; Schenk, P.A., Identification of homologous series of alkylated thiophenes, thiolanes, thianes and benzothiophenes present in pyrolysates of sulphur-rich kerogens, J. Chromatogr., 1988, 435, 435-452, https://doi.org/10.1016/S0021-9673(01)82208-1 . [all data]

Farkas, Héberger, et al., 2004
Farkas, O.; Héberger, K.; Zenkevich, I.G., Quantitative structure-retention relationships. XIV. Prediction of gas chromatographic retention indices for saturated O-, N-, and S-heterocyclic compounds, Chemom. Intell. Lab. Syst., 2004, 72, 2, 173-184, https://doi.org/10.1016/j.chemolab.2004.01.012 . [all data]

van Langenhove and Schamp, 1986
van Langenhove, H.; Schamp, N., Identification of Volatiles in the Head Space of Acid-Treated Phosphate Rock by Gas Chromatography-Mass Spectromety, J. Chromatogr., 1986, 351, 65-75, https://doi.org/10.1016/S0021-9673(01)83473-7 . [all data]