α-Bisabolol

Kovats' RI, non-polar column, isothermal

Data compiled by: NIST Mass Spectrometry Data Center, William E. Wallace, director

Column type CapillaryCapillary
Active phase SE-30SE-30
Column length (m) 40.40.
Carrier gas
Substrate
Column diameter (mm) 0.350.35
Phase thickness (μm) 0.350.35
Temperature (C) 100.180.
I 1664.01666.0
ReferenceTudor, 1997Tudor, 1997
Comment MSDC-RI MSDC-RI

Kovats' RI, non-polar column, temperature ramp

Data compiled by: NIST Mass Spectrometry Data Center, William E. Wallace, director

Column type CapillaryCapillaryCapillaryCapillaryCapillary
Active phase HP-5MSHP-5MSDB-5BP-1DB-1
Column length (m) 30.30.50.25.25.
Carrier gas HeHeHeN2He
Substrate
Column diameter (mm) 0.250.250.320.320.2
Phase thickness (μm) 0.250.250.250.25
Tstart (C) 60.60.50.60.60.
Tend (C) 280.200.280.220.220.
Heat rate (K/min) 2.4.5.5.3.
Initial hold (min) 8.1.2.
Final hold (min) 30.15.10.15.
I 1680.1685.1701.1674.1690.
ReferenceHazzit, Baaliouamer, et al., 2006Juliani, Zygadlo, et al., 2004Baranauskiene, Venskutonis, et al., 2003Raina, Srivastava, et al., 2003Mevy, Bessiere, et al., 2002
Comment MSDC-RI MSDC-RI MSDC-RI MSDC-RI MSDC-RI
Column type CapillaryCapillaryCapillaryCapillaryCapillary
Active phase BP-1BP-1PTE-5SE-30OV-1
Column length (m) 25.30.60.25.30.
Carrier gas N2N2H2HeHe
Substrate
Column diameter (mm) 0.550.320.320.220.31
Phase thickness (μm) 0.250.250.390.253.
Tstart (C) 60.60.60.70.70.
Tend (C) 220.220.285.220.280.
Heat rate (K/min) 5.5.4.35.10.
Initial hold (min)
Final hold (min) 15.13.
I 1673.1668.1690.1650.1685.
ReferenceRaina, Srivastava, et al., 2002Shawl, Srivastava, et al., 2002Gudzic, Dordevic, et al., 2001Kardali, Velasco-Negueruela, et al., 2000Afsharypuor, Asgary, et al., 1996
Comment MSDC-RI MSDC-RI MSDC-RI MSDC-RI MSDC-RI
Column type Capillary
Active phase BP-1
Column length (m) 50.
Carrier gas H2
Substrate
Column diameter (mm) 0.33
Phase thickness (μm)
Tstart (C) 65.
Tend (C) 220.
Heat rate (K/min) 5.
Initial hold (min) 2.
Final hold (min)
I 1662.
ReferenceEkundayo, Laakso, et al., 1988
Comment MSDC-RI

Van Den Dool and Kratz RI, non-polar column, custom temperature program

Data compiled by: NIST Mass Spectrometry Data Center, William E. Wallace, director

Column type CapillaryCapillaryCapillaryCapillaryCapillary
Active phase DB-5VF-5MSDB-5SE-52SE-52
Column length (m) 30.30.30.30.30.
Carrier gas HeHe HeHe
Substrate
Column diameter (mm) 0.250.250.250.320.32
Phase thickness (μm) 0.250.250.250.150.15
Program 40C(2min) => 4C/min => 220C => 20C/min => 280CMulti-step temperature program; T(initial)=60C; T(final)=270C40C(5min) => 2C/min => 250C(15min) => 10C/min => 270C45C => 1C/min => 100C => 5C/min => 250C(10min)45C => 1C/min => 100C => 5C/min => 250C(10min)
I 1684.1710.11687.1685.1686.
ReferenceAndrade, Sampaio, et al., 2007Tret'yakov, 2007Basile, Senatore, et al., 2006Sacchetti, Guerrini, et al., 2006Bruni, Pellati, et al., 2005
Comment MSDC-RI MSDC-RI MSDC-RI MSDC-RI MSDC-RI
Column type CapillaryCapillaryCapillaryCapillaryCapillary
Active phase 5 % Phenyl methyl siloxaneDB-1DB-1DB-1BP-1
Column length (m) 30.30.30.30.50.
Carrier gas HeHeHeHe
Substrate
Column diameter (mm) 0.320.320.320.320.22
Phase thickness (μm) 0.150.10.10.250.25
Program 45C => 1C/min => 100C => 5C/min => 250C (10min)40C(5min) => 20C/min => 100C => 2C/min => 160C => 40C/min => 250C (5min)40C(5min) => 20C/min => 100C => 2C/min => 160C => 40C/min => 250C (5min)40C(5min) => 20C/min => 100C => 2C/min => 160C => 40C/min => 250C (5min)not specified
I 1686.1646.41649.01658.51668.
ReferenceSacchetti, Maietti, et al., 2005Helmig, Bocquet, et al., 2004Helmig, Bocquet, et al., 2004Helmig, Bocquet, et al., 2004Cavalli, Ranarivelo, et al., 2001
Comment MSDC-RI MSDC-RI MSDC-RI MSDC-RI MSDC-RI
Column type Capillary
Active phase SE-52
Column length (m) 60.
Carrier gas He
Substrate
Column diameter (mm) 0.32
Phase thickness (μm) 0.40
Program 45 C (6 min) 3 C/min -> 111 0C 2 C/min -> 160 C 3 C/min -> 300 C (15 min)
I 1689.
ReferenceMondello, Dugo, et al., 1995
Comment MSDC-RI

References

Tudor, 1997
Tudor, E., Temperature dependence of the retention index for perfumery compounds on a SE-30 glass capillary column. I. Linear equations, J. Chromatogr. A, 1997, 779, 1-2, 287-297, https://doi.org/10.1016/S0021-9673(97)00453-6 . [all data]