1H-Naphtho[2,1-b]pyran, 4a,5,6,6a,7,8,9,10,10a,10b-decahydro-3,4a,7,7,10a-pentamethyl-, [4aR-(4aα,6aβ,10aα,10bβ)]-

Van Den Dool and Kratz RI, non-polar column, custom temperature program

View large format table.

Column type Active phase I Reference Comment
CapillaryHP-5MS1894.2Andriamaharavo, 201430. m/0.25 mm/0.25 μm, He; Program: 60C (1 min) => 5 C/min => 210C => 10 C/min => 280C (15 min)

References

Andriamaharavo, 2014
Andriamaharavo, N.R., Retention Data. NIST Mass Spectrometry Data Center., NIST Mass Spectrometry Data Center, 2014. [all data]