Cyclohexane, 1-ethenyl-1-methyl-2,4-bis(1-methylethenyl)-, [1S-(1α,2β,4β)]-

Van Den Dool and Kratz RI, non-polar column, temperature ramp

Data compiled by: NIST Mass Spectrometry Data Center, William E. Wallace, director

Column type CapillaryCapillaryCapillaryCapillaryCapillary
Active phase HP-5MSBP-1CP-Sil PONA GBHP-5BP-1
Column length (m) 30.50.100.25.50.
Carrier gas HeHeHeHeHe
Substrate
Column diameter (mm) 0.250.220.250.250.22
Phase thickness (μm) 0.250.250.250.250.25
Tstart (C) 60.60.140.60.60.
Tend (C) 250.220.230.240.220.
Heat rate (K/min) 2.2.5.4.2.
Initial hold (min) 8. 10.2.
Final hold (min) 30.20.25. 20.
I 1394.1387.1405.1394.1386.
ReferenceBenkaci-Ali, Baaliouamer, et al., 2007Boti, Koukoua, et al., 2007Cunicao, Lopes, et al., 2007Dehghan, Solaimanian, et al., 2007Duquesnoy, Castola, et al., 2007
Comment MSDC-RI MSDC-RI MSDC-RI MSDC-RI MSDC-RI
Column type CapillaryCapillaryCapillaryCapillaryCapillary
Active phase HP-5BP-1DB-5Methyl SiliconeRTX-1
Column length (m) 30.50.30.30.60.
Carrier gas N2He HeHe
Substrate
Column diameter (mm) 0.250.220.220.250.22
Phase thickness (μm) 0.250.250.250.250.25
Tstart (C) 60.60.60.80.60.
Tend (C) 220.220.240.220.230.
Heat rate (K/min) 5.2.3.2.2.
Initial hold (min) 10. 2.
Final hold (min)  20. 15.30.
I 1390.1388.1391.1384.1385.
ReferenceFlamini, Tebano, et al., 2007Lesueur, de Rocca Serra, et al., 2007Martins, Santos, et al., 2007Melo, Corrêa, et al., 2007Muselli, Rossi, et al., 2007
Comment MSDC-RI MSDC-RI MSDC-RI MSDC-RI MSDC-RI
Column type CapillaryCapillaryCapillaryCapillaryCapillary
Active phase RTX-1HP-101HP-5SPB-1HP-5MS
Column length (m) 60.25.30.30.30.
Carrier gas HeHeHeHeHe
Substrate
Column diameter (mm) 0.220.20.250.250.25
Phase thickness (μm) 0.250.20.250.250.25
Tstart (C) 60.70.50.50.60.
Tend (C) 230.200.250.250.280.
Heat rate (K/min) 2.3.4.5.4.
Initial hold (min)  2.4.3.5.
Final hold (min) 35.15.10.15.
I 1387.1364.1391.1379.1388.
ReferencePaolini J., Costa J., et al., 2007Politeo, Jukic, et al., 2007Quijano, Salamanca, et al., 2007Radulovic, Lazarevic, et al., 2007Radulovic, Lazarevic, et al., 2007
Comment MSDC-RI MSDC-RI MSDC-RI MSDC-RI MSDC-RI
Column type CapillaryCapillaryCapillaryCapillaryCapillary
Active phase DB-5DB-5HP-5MSZB-5DB-5
Column length (m) 25.30.30.30.30.
Carrier gas HeHeHeHeHe
Substrate
Column diameter (mm) 0.250.250.250.250.25
Phase thickness (μm) 0.250.250.250.250.25
Tstart (C) 60.60.60.50.60.
Tend (C) 200.260.280.250.240.
Heat rate (K/min) 2.5.4.3.3.
Initial hold (min)   5.
Final hold (min) 60.
I 1389.1398.1391.1392.1391.
ReferenceRout, Rao, et al., 2007Sabulal, Dan, et al., 2007Saroglou, Marin, et al., 2007Simoniatto, Bonani, et al., 2007Telascrea, de Araujo, et al., 2007
Comment MSDC-RI MSDC-RI MSDC-RI MSDC-RI MSDC-RI
Column type CapillaryCapillaryCapillaryCapillaryCapillary
Active phase HP-5MSDB-5HP-5MSSPB-1DB-5
Column length (m) 30.30.30.30.30.
Carrier gas HeHeHeHeHe
Substrate
Column diameter (mm) 0.250.250.250.250.2
Phase thickness (μm) 0.250.250.250.250.25
Tstart (C) 60.50.60.50.50.
Tend (C) 280.250.280.250.250.
Heat rate (K/min) 3.3.3.5.5.
Initial hold (min)    3.3.
Final hold (min)  10. 15.15.
I 1388.1387.1368.1380.1393.
ReferenceVagionas, Ngassapa, et al., 2007Yu, Liao, et al., 2007Basta, Tzakou, et al., 2006Blagojevic, Radulovic, et al., 2006Blagojevic, Radulovic, et al., 2006
Comment MSDC-RI MSDC-RI MSDC-RI MSDC-RI MSDC-RI
Column type CapillaryCapillaryCapillaryCapillaryCapillary
Active phase BP-1DB-5BP-1HP-5BP-1
Column length (m) 50.30.50.30.50.
Carrier gas HeN2HeN2He
Substrate
Column diameter (mm) 0.220.320.220.250.22
Phase thickness (μm) 0.250.250.250.250.25
Tstart (C) 60.60.60.60.60.
Tend (C) 220.240.220.220.220.
Heat rate (K/min) 2.3.2.5.2.
Initial hold (min)  3. 10.
Final hold (min) 20.5.20. 20.
I 1388.1389.1386.1391.1389.
ReferenceBoti, Bighelli, et al., 2006Dob, Dahmane, et al., 2006Duquesnoy, Dinh, et al., 2006Flamini, Tebano, et al., 2006Gonny, Cavaleiro, et al., 2006
Comment MSDC-RI MSDC-RI MSDC-RI MSDC-RI MSDC-RI
Column type CapillaryCapillaryCapillaryCapillaryCapillary
Active phase DB-1HP-5MSDB-5HP-5MSDB-5
Column length (m) 30.30.50.30.30.
Carrier gas N2HeN2HeHe
Substrate
Column diameter (mm) 0.250.250.20.250.32
Phase thickness (μm) 0.250.250.320.250.25
Tstart (C) 50.60.60.60.60.
Tend (C) 220.280.220.280.280.
Heat rate (K/min) 4.3.5.3.3.
Initial hold (min)   3.
Final hold (min)   5.
I 1386.1390.1391.1366.1382.
ReferenceKuiate, Bessière, et al., 2006Kukic J., Petrovic S., et al., 2006Masoudi, Esmaeili, et al., 2006Pavlovic, Kovacevic, et al., 2006Pavlovic, Tzakou, et al., 2006
Comment MSDC-RI MSDC-RI MSDC-RI MSDC-RI MSDC-RI
Column type CapillaryCapillaryCapillaryCapillaryCapillary
Active phase HP-5SPB-1DB-1HP-5OV-1
Column length (m) 60.30.30.25.25.
Carrier gas HeHeHeHeHe
Substrate
Column diameter (mm) 0.250.250.250.250.25
Phase thickness (μm) 0.250.250.250.250.25
Tstart (C) 60.50.60.60.50.
Tend (C) 250.250.240.240.220.
Heat rate (K/min) 3.5.4.4.3.
Initial hold (min)  3.  1.
Final hold (min)  15.  5.
I 1399.1381.1389.1394.1391.
ReferencePerraudin, Popovici, et al., 2006Radulovic, Mananjarasoa, et al., 2006Rezazadeh, Hamedani, et al., 2006Rezazadeh, Hamedani, et al., 2006Rubiolo P., Matteodo M., et al., 2006
Comment MSDC-RI MSDC-RI MSDC-RI MSDC-RI MSDC-RI
Column type CapillaryCapillaryCapillaryCapillaryCapillary
Active phase SPB-1HP-5MSHP-5MSDB-5DB-5
Column length (m) 30.30.30.30.30.
Carrier gas HeHeHeHeHe
Substrate
Column diameter (mm) 0.20.250.250.250.25
Phase thickness (μm) 0.20.250.250.250.25
Tstart (C) 70.60.60.50.50.
Tend (C) 220.280.300.250.250.
Heat rate (K/min) 3.4.3.5.5.
Initial hold (min)  5. 2.2.
Final hold (min) 15.
I 1382.1388.1383.1391.1391.
ReferenceSalgueiro L.R., Pinto E., et al., 2006Saroglou, Dorizas, et al., 2006Silva-Brandão, Solferini, et al., 2006Su, Ho, et al., 2006Su, Ho, et al., 2006, 2
Comment MSDC-RI MSDC-RI MSDC-RI MSDC-RI MSDC-RI
Column type CapillaryCapillaryCapillaryCapillaryCapillary
Active phase HP-5MSHP-5HP-5DB-1BP-1
Column length (m) 30.30.30.30.50.
Carrier gas H2HeHeN2He
Substrate
Column diameter (mm) 0.250.250.250.250.22
Phase thickness (μm) 0.250.250.250.250.25
Tstart (C) 50.40.60.50.60.
Tend (C) 285.300.250.200.220.
Heat rate (K/min) 4.34.10.5.2.
Initial hold (min)  5.2.
Final hold (min)   10. 20.
I 1385.1390.1400.1394.1388.
ReferenceVujisic L., Vuckovic I., et al., 2006Vundac, Pfeifhofer, et al., 2006Zhao J.Y., Liu J.M., et al., 2006Agnaniet, Makani, et al., 2005Boti J.B., Koukoua G., et al., 2005
Comment MSDC-RI MSDC-RI MSDC-RI MSDC-RI MSDC-RI
Column type CapillaryCapillaryCapillaryCapillaryCapillary
Active phase SE-54DB-5HP-5MDN-5DB-1
Column length (m) 50.60.30.30.30.
Carrier gas H2N2N2HeHe
Substrate
Column diameter (mm) 0.250.250.250.250.25
Phase thickness (μm) 0.270.250.250.250.25
Tstart (C) 50.70.60.50.40.
Tend (C) 300.230.220.250.250.
Heat rate (K/min) 5.2.5.3.3.
Initial hold (min)  2.10.
Final hold (min)  20.  20.
I 1392.1393.1392.1386.1370.
ReferenceBrantner, Pfeifhofer, et al., 2005Choi, 2005Cioni, Flamini, et al., 2005Dugo, Mondello, et al., 2005Fanciullino, Gancel, et al., 2005
Comment MSDC-RI MSDC-RI MSDC-RI MSDC-RI MSDC-RI
Column type CapillaryCapillaryCapillaryCapillaryCapillary
Active phase DB-1HP-5DB-1CP Sil 5 CBDB-1
Column length (m) 30.30.30.50.25.
Carrier gas HeN2HeH2
Substrate
Column diameter (mm) 0.250.250.250.220.25
Phase thickness (μm) 0.250.250.250.130.25
Tstart (C) 40.60.40.40.60.
Tend (C) 260.220.250.300.180.
Heat rate (K/min) 2.5.3.4.3.
Initial hold (min) 5.10.  10.
Final hold (min) 20. 20.10.10.
I 1362.1392.1370.1380.1390.
Referencede Feo, Urrunaga Soria, et al., 2005Flamini, Luigi Cioni, et al., 2005Gancel, Ollitrault, et al., 2005Idzojtic, Kajba, et al., 2005bin Jantan, Yalvema, et al., 2005
Comment MSDC-RI MSDC-RI MSDC-RI MSDC-RI MSDC-RI
Column type CapillaryCapillaryCapillaryCapillaryCapillary
Active phase DB-5HP-5HP-5HP-5RTX-1
Column length (m) 25.30.30.30.60.
Carrier gas N2HeHe He
Substrate
Column diameter (mm) 0.250.250.25 0.22
Phase thickness (μm) 0.250.25  0.25
Tstart (C) 75.60.60.50.60.
Tend (C) 210.260.260.290.230.
Heat rate (K/min) 3.3.3.4.2.
Initial hold (min) 10.
Final hold (min) 1.   35.
I 1391.1393.1392.1392.1387.
Referencebin Jantan, Yalvema, et al., 2005, 2Javidnia, Miri, et al., 2005Javidnia, Miri, et al., 2005, 2Magalhães, Ruiz, et al., 2005Paolini, Costa, et al., 2005
Comment MSDC-RI MSDC-RI MSDC-RI MSDC-RI MSDC-RI
Column type CapillaryCapillaryCapillaryCapillaryCapillary
Active phase HP-5MSDB-5DB-5MSHP-5MSDB-1
Column length (m) 30.30.60.60.30.
Carrier gas HeHeHeHeN2
Substrate
Column diameter (mm) 0.250.250.250.20.25
Phase thickness (μm) 0.250.250.250.250.25
Tstart (C) 60.40.40.60.50.
Tend (C) 250.260.200.200.200.
Heat rate (K/min) 4.2.2.2.5.
Initial hold (min) 2.5.
Final hold (min) 20.20.20.10.
I 1391.1385.1388.1381.1388.
ReferencePino, Mesa, et al., 2005Senatore, Napolitano, et al., 2005Seo and Baek, 2005Smadja, Rondeau, et al., 2005Tchoumbougnang, Zollo, et al., 2005
Comment MSDC-RI MSDC-RI MSDC-RI MSDC-RI MSDC-RI
Column type CapillaryCapillaryCapillaryCapillaryCapillary
Active phase BP-1DB-5HP-5MSSPB-1HP-5
Column length (m) 50.30.30.30.30.
Carrier gas HeHeHeHeN2
Substrate
Column diameter (mm) 0.220.260.250.250.25
Phase thickness (μm) 0.250.250.250.250.25
Tstart (C) 60.60.60.70.60.
Tend (C) 230.246.280.220.220.
Heat rate (K/min) 2.3.3.3.5.
Initial hold (min)     10.
Final hold (min) 35.  15.
I 1388.1390.1388.1381.1392.
ReferenceVellutini, Baldovini, et al., 2005Adams, Habte, et al., 2004Aligiannis, Kalpoutzakis, et al., 2004Antunes, Sevinate-Pinto, et al., 2004Bertoli, Menichini, et al., 2004
Comment MSDC-RI MSDC-RI MSDC-RI MSDC-RI MSDC-RI
Column type CapillaryCapillaryCapillaryCapillaryCapillary
Active phase HP-5SPB-1HP-5HP-5MSDB-5
Column length (m) 30.30.30.30.30.
Carrier gas N2He HeN2
Substrate
Column diameter (mm) 0.250.20.250.250.25
Phase thickness (μm) 0.250.20.250.250.25
Tstart (C) 60.70.60.60.60.
Tend (C) 220.220.220.280.240.
Heat rate (K/min) 5.3.5.3.3.
Initial hold (min) 10. 10.
Final hold (min)  15.
I 1392.1381.1392.1390.1391.
ReferenceBertoli, Pistelli, et al., 2004Cavaleiro, Salgueiro, et al., 2004Ceccarini, Macchia, et al., 2004Chorianopoulos, Kalpoutzakis, et al., 2004Flamini, Cioni, et al., 2004
Comment MSDC-RI MSDC-RI MSDC-RI MSDC-RI MSDC-RI
Column type CapillaryCapillaryCapillaryCapillaryCapillary
Active phase DB-5HP-5HP-5HP-5MSHP-5
Column length (m) 30.30.30.30.30.
Carrier gas N2HeN2HeHe
Substrate
Column diameter (mm) 0.250.250.250.250.25
Phase thickness (μm) 0.250.250.250.250.25
Tstart (C) 60.50.60.60.60.
Tend (C) 240.290.220.280.260.
Heat rate (K/min) 3.4.5.4.3.
Initial hold (min)   10.5.
Final hold (min)
I 1391.1392.1393.1391.1391.
ReferenceFlamini, Cioni, et al., 2004Flach A., Dondon R.C., et al., 2004Flamini, Luigi Cioni, et al., 2004Grujic-Jovanovic, Skaltsa, et al., 2004Javidnia, Miri, et al., 2004
Comment MSDC-RI MSDC-RI MSDC-RI MSDC-RI MSDC-RI
Column type CapillaryCapillaryCapillaryCapillaryCapillary
Active phase HP-5MSDB-5MSSPB-1HP-5MSRSL-200
Column length (m) 30.30.30.30.30.
Carrier gas HeHeHeHeH2
Substrate
Column diameter (mm) 0.250.250.20.250.32
Phase thickness (μm) 0.250.250.20.250.25
Tstart (C) 60.40.70.50.40.
Tend (C) 280.280.220.300.280.
Heat rate (K/min) 4.4.3.5.6.
Initial hold (min) 5.2. 5.5.
Final hold (min)   15. 5.
I 1389.1394.1382.1392.1408.
ReferenceKarioti, Hadjipavlou-Litina, et al., 2004Mardarowicz, Wianowska, et al., 2004Moldão-Martins, Beirão-da-Costa, et al., 2004Mumm, Tiemann, et al., 2004Ngassoum, Ousmaila, et al., 2004
Comment MSDC-RI MSDC-RI MSDC-RI MSDC-RI MSDC-RI
Column type CapillaryCapillaryCapillaryCapillaryCapillary
Active phase Methyl SiliconeHP-5BP-1HP-5MSOptima 5
Column length (m) 50.25.50.30.25.
Carrier gas HeHeHeHeHe
Substrate
Column diameter (mm) 0.250.20.220.250.25
Phase thickness (μm)  0.330.250.250.25
Tstart (C) 50.60.60.60.60.
Tend (C) 240.240.220.280.280.
Heat rate (K/min) 3.3.2.3.3.
Initial hold (min)
Final hold (min)  7.20. 20.
I 1391.1393.1387.1371.1387.
ReferenceÖzcan and Chalchat, 2004Sartoratto, Machado, et al., 2004Tam, Thuam, et al., 2004Tzakou, Vagias, et al., 2004Vérité, Nacer, et al., 2004
Comment MSDC-RI MSDC-RI MSDC-RI MSDC-RI MSDC-RI
Column type CapillaryCapillaryCapillaryCapillaryCapillary
Active phase SBP-5DB-5MSDB-5BPX-5DB-5
Column length (m) 60.30.25.30.30.
Carrier gas HeliumHeN2N2He
Substrate
Column diameter (mm) 0.250.250.250.250.25
Phase thickness (μm) 0.250.250.250.250.25
Tstart (C) 50.40.75.75.60.
Tend (C) 240.200.210.210.240.
Heat rate (K/min) 5.4.3.3.3.
Initial hold (min) 3.5.10.10.
Final hold (min) 10.20.1.1.30.
I 1362.1394.1390.1391.1393.
ReferenceYoo, Kim, et al., 2004Yu, Kim, et al., 2004bin Ahmad and bin Jantan, 2003bin Ahmad and bin Jantan, 2003, 2Bader, Caponi, et al., 2003
Comment MSDC-RI MSDC-RI MSDC-RI MSDC-RI MSDC-RI
Column type CapillaryCapillaryCapillaryCapillaryCapillary
Active phase DB-5SPB-1RTX-1DB-5HP-5
Column length (m) 30.30.60.30.30.
Carrier gas N2HeHeN2N2
Substrate
Column diameter (mm) 0.250.20.220.250.25
Phase thickness (μm) 0.250.20.250.250.25
Tstart (C) 60.70.60.70.60.
Tend (C) 220.220.230.230.220.
Heat rate (K/min) 5.3.2.2.5.
Initial hold (min) 10.  2.10.
Final hold (min)  15.45.20.
I 1393.1382.1387.1393.1392.
ReferenceBader, Caponi, et al., 2003, 2Cavaleiro, Salgueiro, et al., 2003Cavalli, Tomi, et al., 2003Choi, 2003Ertugrul, Dural, et al., 2003
Comment MSDC-RI MSDC-RI MSDC-RI MSDC-RI MSDC-RI
Column type CapillaryCapillaryCapillaryCapillaryCapillary
Active phase DB-1HP-5DB-1HP-5DB-5
Column length (m) 30.30.30.30.30.
Carrier gas HeN2He He
Substrate
Column diameter (mm) 0.250.250.250.250.25
Phase thickness (μm) 0.250.250.25 0.25
Tstart (C) 40.60.40.25.75.
Tend (C) 250.220.250.150.230.
Heat rate (K/min) 2.5.3.3.3.
Initial hold (min) 5.10. 5.10.
Final hold (min) 20. 20. 20.
I 1375.1392.1370.1394.1386.
Referencede Feo, Bruno, et al., 2003Flamini, Luigi Cioni, et al., 2003Gancel, Ollitrault, et al., 2003Isidorov, Vinogorova, et al., 2003Jantan, Ling, et al., 2003
Comment MSDC-RI MSDC-RI MSDC-RI MSDC-RI MSDC-RI
Column type CapillaryCapillaryCapillaryCapillaryCapillary
Active phase DB-5HP-5HP-5HP-5HP-5
Column length (m) 30.30.30.30.30.
Carrier gas N2HeHeHeHe
Substrate
Column diameter (mm) 0.250.250.250.250.25
Phase thickness (μm) 0.250.250.250.250.25
Tstart (C) 75.60.60.60.60.
Tend (C) 230.280.280.280.280.
Heat rate (K/min) 3.3.4.3.3.
Initial hold (min) 10. 5.
Final hold (min)
I 1388.1391.1391.1391.1391.
Referencebin Jantan, Yassin, et al., 2003Ngassapa, Runyoro, et al., 2003Skaltsa, Demetzos, et al., 2003Tsiri, Kretsi, et al., 2003Tsiri, Kretsi, et al., 2003
Comment MSDC-RI MSDC-RI MSDC-RI MSDC-RI MSDC-RI
Column type CapillaryCapillaryCapillaryCapillaryCapillary
Active phase DB-5HP-5MSDB-5HP-5HP-5
Column length (m) 30.30.30.30.30.
Carrier gas HeHeHeN2
Substrate
Column diameter (mm) 0.250.250.250.250.25
Phase thickness (μm) 0.250.250.250.250.25
Tstart (C) 70.60.60.60.60.
Tend (C) 230.300.240.220.280.
Heat rate (K/min) 4.3.3.5.3.
Initial hold (min) 2.  10.5.
Final hold (min) 20.
I 1393.1393.1393.1393.1389.
ReferenceChoi, Kim. M.-S.L., et al., 2002Couladis, Chinou, et al., 2002Flamini, Cioni, et al., 2002Flamini, Cioni, et al., 2002, 2Fokialakis, Magiatis, et al., 2002
Comment MSDC-RI MSDC-RI MSDC-RI MSDC-RI MSDC-RI
Column type CapillaryCapillaryCapillaryCapillaryCapillary
Active phase CP Sil 5 CBDB-1DB-5HP-5BP-1
Column length (m) 50.25.30.30.50.
Carrier gas H2N2HeHeHe
Substrate
Column diameter (mm) 0.250.250.250.250.22
Phase thickness (μm) 0.15 0.250.250.25
Tstart (C) 40.60.60.60.60.
Tend (C) 300.180.260.280.220.
Heat rate (K/min) 4.3.4.3.2.
Initial hold (min) 3.10.
Final hold (min)  10.  20.
I 1391.1386.1391.1387.1388.
ReferenceHeinrich, Pfeifhofer, et al., 2002bin Jantan and bin Ahmad, 2002Javidnia, Miri, et al., 2002Kovacevic, Pavlovic, et al., 2002Lota, de Rocca Serra, et al., 2002
Comment MSDC-RI MSDC-RI MSDC-RI MSDC-RI MSDC-RI
Column type CapillaryCapillaryCapillaryCapillaryCapillary
Active phase RTX-5HP-1CP Sil 5 CBHP-5HP-5
Column length (m) 30.24.50.30.30.
Carrier gas HeHeHeHeHe
Substrate
Column diameter (mm) 0.250.320.320.250.25
Phase thickness (μm) 0.250.170.40.250.25
Tstart (C) 45.60.60.60.60.
Tend (C) 300.250.280.280.280.
Heat rate (K/min) 3.4.3.3.3.
Initial hold (min) 6.2.10. 5.
Final hold (min) 10.20.60.
I 1392.1384.1388.1363.1389.
ReferenceMondello, Zappia, et al., 2002Nath, Sarma, et al., 2002Pino, Marbot, et al., 2002Pitarokili, Couladis, et al., 2002Aligiannis, Kalpoutzakis, et al., 2001
Comment MSDC-RI MSDC-RI MSDC-RI MSDC-RI MSDC-RI
Column type CapillaryCapillaryCapillaryCapillaryCapillary
Active phase DB-5HP-1HP-5DB-5SE-30
Column length (m) 30.60.50.30.25.
Carrier gas HeHeHeHeN2
Substrate
Column diameter (mm) 0.250.250.250.250.20
Phase thickness (μm) 0.250.250.25
Tstart (C) 60.50.50.50.60.
Tend (C) 300.250.250.250.180.
Heat rate (K/min) 5.2.52.53.3.
Initial hold (min) 3.5.5. 10.
Final hold (min)     1.
I 1395.1403.1387.1391.1388.
ReferenceBortolomeazzi, Berno, et al., 2001Guilliard, Delgado, et al., 2001Guilliard, Delgado, et al., 2001Isidorov, Zenkevich, et al., 2001bin Jantan, Basni, et al., 2001
Comment MSDC-RI MSDC-RI MSDC-RI MSDC-RI MSDC-RI
Column type CapillaryCapillaryCapillaryCapillaryCapillary
Active phase DB-5BP-1HP-5MSBPX-5HP-5
Column length (m) 30.50.30.50.30.
Carrier gas H2 HeH2He
Substrate
Column diameter (mm) 0.250.220.250.220.20
Phase thickness (μm) 0.250.250.250.250.25
Tstart (C) 60.60.60.60.60.
Tend (C) 240.220.280.180.180.
Heat rate (K/min) 3.2.4.4.4.
Initial hold (min)   5.5.8.
Final hold (min)  20. 5.2.
I 1394.1388.1391.1402.1391.
ReferenceNogueira, Bittrich, et al., 2001Rezzi, Cavaleiro, et al., 2001Skaltsa, Mavrommati, et al., 2001Zabaras and Wyllie, 2001Alonzo, Bosco, et al., 2000
Comment MSDC-RI MSDC-RI MSDC-RI MSDC-RI MSDC-RI
Column type CapillaryCapillaryCapillaryCapillaryCapillary
Active phase DB-5DB-5HP-5HP-5BP-1
Column length (m) 60.30.30.30.50.
Carrier gas HeHeHeHeHe
Substrate
Column diameter (mm) 0.250.250.250.250.22
Phase thickness (μm) 0.250.250.250.250.25
Tstart (C) 40.60.40.50.60.
Tend (C) 290.300.200.280.230.
Heat rate (K/min) 4.5.2.4.2.
Initial hold (min) 2.3.5.5.
Final hold (min) 5. 20. 35.
I 1393.1395.1388.1387.1388.
ReferenceBartley and Jacobs, 2000Bortolomeazzi, Pizzale, et al., 2000Kim, Thuy, et al., 2000Lazari, Skaltsa, et al., 2000Lota, de Rocca Serra, et al., 2000
Comment MSDC-RI MSDC-RI MSDC-RI MSDC-RI MSDC-RI
Column type CapillaryCapillaryCapillaryCapillaryCapillary
Active phase BP-1DB-5DB-5DB-5DB-5
Column length (m) 50.30.30.30.30.
Carrier gas HeHeHeHeHe
Substrate
Column diameter (mm) 0.220.250.250.250.25
Phase thickness (μm) 0.250.250.250.250.25
Tstart (C) 60.60.60.60.60.
Tend (C) 230.240.240.240.240.
Heat rate (K/min) 2.3.3.3.3.
Initial hold (min)  2.2.2.2.
Final hold (min) 35.
I 1388.1390.1390.1390.1392.
ReferenceLota, de Rocca Serra, et al., 2000Maia, de Paula, et al., 2000Maia, de Paula, et al., 2000Maia, de Paula, et al., 2000Maia, de Paula, et al., 2000
Comment MSDC-RI MSDC-RI MSDC-RI MSDC-RI MSDC-RI
Column type CapillaryCapillaryCapillaryCapillaryCapillary
Active phase OV-101RTX-5CP Sil 5 CBHP-5HP-5
Column length (m) 25.10.50.30.30.
Carrier gas N2HeH2HeHe
Substrate
Column diameter (mm) 0.250.10.220.250.25
Phase thickness (μm)  0.10.130.250.25
Tstart (C) 50.50.40.50.70.
Tend (C) 200.350.300.280.230.
Heat rate (K/min) 5.12.34.4.2.
Initial hold (min)    5.
Final hold (min)   10.
I 1389.1398.1391.1391.1385.
ReferenceMenut, Bessiere, et al., 2000Mondello, Zappia, et al., 2000Pfeifhofer, 2000Skaltsa, Lazari, et al., 2000Song, Sawamura, et al., 2000
Comment MSDC-RI MSDC-RI MSDC-RI MSDC-RI MSDC-RI
Column type CapillaryCapillaryCapillaryCapillaryCapillary
Active phase DB-5Mega 5MSCBP-1HP-5DB-1
Column length (m) 30.30.30.30.60.
Carrier gas N2HeHeHeHe
Substrate
Column diameter (mm) 0.250.250.250.250.25
Phase thickness (μm) 0.250.25 0.250.25
Tstart (C) 70.40.60.50.50.
Tend (C) 230.240.240.280.220.
Heat rate (K/min) 2.3.4.4.4.
Initial hold (min)  2. 5.
Final hold (min)
I 1385.1381.1394.1391.1398.
ReferenceSong, Sawamura, et al., 2000, 2Verzera, Trozzi, et al., 2000Zunino, Lopez, et al., 2000Lazari, Skaltsa, et al., 1999Mirza and Sefidkon, 1999
Comment MSDC-RI MSDC-RI MSDC-RI MSDC-RI MSDC-RI
Column type CapillaryCapillaryCapillaryCapillaryCapillary
Active phase DB-1HP-1Methyl SiliconeOV-1OV-1
Column length (m) 30.60.50.25.25.
Carrier gas  HeN2 H2
Substrate
Column diameter (mm) 0.250.250.250.250.25
Phase thickness (μm) 0.250.250.170.30.3
Tstart (C) 50.50.80.50.50.
Tend (C) 220.250.200.200.200.
Heat rate (K/min) 3.2.52.3.3.
Initial hold (min) 3.5. 1.1.
Final hold (min)    20.20.
I 1377.1407.1395.1372.1374.
ReferenceMuselli, Hoi, et al., 1999Stashenko, Cervantes, et al., 1999Sumathykutty, Rao, et al., 1999Bicchi, Rubiolo, et al., 1998Bicchi, Fresia, et al., 1997
Comment MSDC-RI MSDC-RI MSDC-RI MSDC-RI MSDC-RI
Column type CapillaryCapillaryCapillaryCapillaryCapillary
Active phase DB-5DB-5Methyl SiliconeDB-1DB-1
Column length (m) 30.60.25.30.60.
Carrier gas HeHeHeHe
Substrate
Column diameter (mm) 0.260.240.20.200.32
Phase thickness (μm) 0.25 0.30.200.5
Tstart (C) 50.50.40.70.40.
Tend (C) 225.280.200.200.290.
Heat rate (K/min) 2.5.2.4.4.
Initial hold (min)  3. 5.2.
Final hold (min) 20.   5.
I 1388.1390.1408.1400.1391.
ReferenceSagrero-Nieves, Bartley, et al., 1997Tzakou, Roussis, et al., 1997Píry, Príbela, et al., 1995Stashenko, Wiame, et al., 1995Bartley and Foley, 1994
Comment MSDC-RI MSDC-RI MSDC-RI MSDC-RI MSDC-RI
Column type CapillaryCapillaryCapillaryCapillaryCapillary
Active phase OV-101OV-101DB-5CP Sil 5 CBCP Sil 5 CB
Column length (m) 50.50.60.25.25.
Carrier gas N2N2HeN2N2
Substrate
Column diameter (mm) 0.250.250.320.220.22
Phase thickness (μm)   1.
Tstart (C) 80.80.40.70.70.
Tend (C) 200.200.220.295.295.
Heat rate (K/min) 2.2.3.4.4.
Initial hold (min)
Final hold (min)
I 1385.1388.1406.1400.1374.
ReferenceYang, Sugisawa, et al., 1992Yang, Sugisawa, et al., 1992Le Quere and Latrasse, 1990Montanarella, Bos, et al., 1986Montanarella, Bos, et al., 1986
Comment MSDC-RI MSDC-RI MSDC-RI MSDC-RI MSDC-RI

Normal alkane RI, polar column, temperature ramp

Data compiled by: NIST Mass Spectrometry Data Center, William E. Wallace, director

Column type CapillaryCapillaryCapillaryCapillaryCapillary
Active phase RTX-WaxHP-InnowaxHP-InnowaxCP-Wax 52 CBBP-20
Column length (m) 60.60.60.60.
Carrier gas HeliumHeliumHeliumHeliumNitrogen
Substrate
Column diameter (mm) 0.220.250.250.25
Phase thickness (μm) 0.250.250.250.25
Tstart (C) 60.60.60.40.60.
Tend (C) 230.220.220.220.200.
Heat rate (K/min) 2.5.3.3.5.
Initial hold (min)  1.1.
Final hold (min) 5.5.5.
I 1570.1592.1605.1587.1585.
ReferenceBendiabdellah, El Amine Dib, et al., 2012Feng, Cui, et al., 2011Feng, Zhuang, et al., 2011Tsai, Huang, et al., 2011Mishra, Chaudhary, et al., 2010
Comment MSDC-RI MSDC-RI MSDC-RI MSDC-RI MSDC-RI
Column type CapillaryCapillaryCapillaryCapillaryCapillary
Active phase SupelcowaxDB-WaxRTX-WaxBP-20DB-Wax
Column length (m) 60.30.60.50.60.
Carrier gas NitrogenHydrogenHeliumHeliumHelium
Substrate
Column diameter (mm) 0.350.250.220.220.25
Phase thickness (μm) 0.250.250.250.250.25
Tstart (C) 60.30.60.60.50.
Tend (C) 230.230.230.220.220.
Heat rate (K/min) 4.8.2.2.3.
Initial hold (min)  5.  2.
Final hold (min) 40.10.30.20.70.
I 1596.1589.1570.1587.1595.
ReferenceGauvin-Bialecki and Marodon, 2009Karlsson, Birgersson, et al., 2009Museli, Pau, et al., 2009Ottavioli, Bighelli, et al., 2009Shimizu, Imayoshi, et al., 2009
Comment MSDC-RI MSDC-RI MSDC-RI MSDC-RI MSDC-RI
Column type CapillaryCapillaryCapillaryCapillaryCapillary
Active phase HP-InnowaxDB-WaxRTX-WaxHP InnowaxCarbowax
Column length (m) 30.30.60.30.60.
Carrier gas NitrogenHeliumHeHeliumHe
Substrate
Column diameter (mm) 0.250.250.220.320.2
Phase thickness (μm) 0.520.250.250.500.25
Tstart (C) 35.60.60.60.60.
Tend (C) 205.250.230.260.250.
Heat rate (K/min) 3.10.2.3.2.
Initial hold (min) 10.2.  8.
Final hold (min) 10.10.35. 15.
I 1600.1599.1579.1578.1540.
ReferenceWannes, Mhamdi, et al., 2009Guo, Wu, et al., 2008Paolini, Tomi, et al., 2008Capetanos, Saroglou, et al., 2007Ferhat, Tigrine-Kordjani, et al., 2007
Comment MSDC-RI MSDC-RI MSDC-RI MSDC-RI MSDC-RI
Column type CapillaryCapillaryCapillaryCapillaryCapillary
Active phase HP-InnowaxHP-InnowaxCP-Wax 52CBTC-FFAPTC-FFAP
Column length (m) 30.30.30.
Carrier gas HeliumHeHeHeHe
Substrate
Column diameter (mm) 0.250.250.320.250.25
Phase thickness (μm) 0.250.250.250.250.25
Tstart (C) 40.60.40.60.60.
Tend (C) 250.240.220.220.220.
Heat rate (K/min) 2.2.3.3.3.
Initial hold (min) 5. 1.
Final hold (min)  20.2.30.30.
I 1600.1581.1585.1593.1590.
ReferenceFormisano, Rigano, et al., 2007Hachicha, Skanji, et al., 2007Hymete, Rohloff, et al., 2007Kurose, Okamura, et al., 2007Kurose, Okamura, et al., 2007
Comment MSDC-RI MSDC-RI MSDC-RI MSDC-RI MSDC-RI
Column type CapillaryCapillaryCapillaryCapillaryCapillary
Active phase Supelcowax-10Supelcowax-10Supelcowax-10DB-WaxBP-20
Column length (m) 30.30.30.60.50.
Carrier gas He  HeHe
Substrate
Column diameter (mm) 0.250.250.250.250.22
Phase thickness (μm) 0.250.250.250.250.25
Tstart (C) 50.40.40.60.60.
Tend (C) 250.210.250.180.220.
Heat rate (K/min) 2.2.2.3.2.
Initial hold (min)    8.
Final hold (min)  33.33.80.20.
I 1587.1589.1589.1595.1580.
ReferenceRaal, Orav, et al., 2007Sylvestre, Longtin, et al., 2007Sylvestre, Pichette, et al., 2007Wei A. and Shibamoto T., 2007Boti, Muselli, et al., 2006
Comment MSDC-RI MSDC-RI MSDC-RI MSDC-RI MSDC-RI
Column type CapillaryCapillaryCapillaryCapillaryCapillary
Active phase BP-20DB-WaxSupelcowax 10DB-WaxDB-Wax
Column length (m) 50.60.30.60.60.
Carrier gas  HeHeliumHeN2
Substrate
Column diameter (mm) 0.220.250.200.250.25
Phase thickness (μm) 0.250.50.200.250.25
Tstart (C) 60.50.70.70.70.
Tend (C) 220.230.220.230.230.
Heat rate (K/min) 2.3.3.2.2.
Initial hold (min)  2. 2.2.
Final hold (min) 20.20.15.20.20.
I 1587.1582.1585.1595.1605.
ReferenceBoti, Yao, et al., 2006Cai, Lin, et al., 2006Cavaleiro, Pinto, et al., 2006Choi H.S., 2006Choi, 2006
Comment MSDC-RI MSDC-RI MSDC-RI MSDC-RI MSDC-RI
Column type CapillaryCapillaryCapillaryCapillaryCapillary
Active phase BP-20Supelcowax-10DB-WaxDB-WaxBP-20
Column length (m) 50.30.30.60.50.
Carrier gas He He He
Substrate
Column diameter (mm) 0.220.250.250.250.22
Phase thickness (μm) 0.250.250.250.250.25
Tstart (C) 60.40.50.70.60.
Tend (C) 220.210.250.230.220.
Heat rate (K/min) 2.2.3.2.2.
Initial hold (min)  2. 2.
Final hold (min) 20.33.10.20.20.
I 1589.1588.1583.1590.1593.
ReferenceFanciullino, Tomi, et al., 2006Garneau F.X., Collin G., et al., 2006Havlik, Kokoska, et al., 2006Lan Phi N.T., Nishiyama C., et al., 2006Lesueur, Ban, et al., 2006
Comment MSDC-RI MSDC-RI MSDC-RI MSDC-RI MSDC-RI
Column type CapillaryCapillaryCapillaryCapillaryCapillary
Active phase SupelcowaxNB-20MSupelcowax-10DB-WaxSupelcowax
Column length (m) 30.30.30.30.60.
Carrier gas N2HeHeN2He
Substrate
Column diameter (mm) 0.320.20.250.250.2
Phase thickness (μm) 0.250.250.250.250.2
Tstart (C) 50.50.50.60.60.
Tend (C) 200.250.220.250.230.
Heat rate (K/min) 5.2.4.5.4.
Initial hold (min)   1. 30.
Final hold (min)   10.10.
I 1591.1608.1580.1581.1569.
ReferenceMartin, Joseph, et al., 2006Orav, Raal, et al., 2006Wong, Lim, et al., 2006Fakhari A.R., Sonboli A., et al., 2005Gauvin and Smadja, 2005
Comment MSDC-RI MSDC-RI MSDC-RI MSDC-RI MSDC-RI
Column type CapillaryCapillaryCapillaryCapillaryCapillary
Active phase StabilwaxStabilwaxInnowaxCP-WaxDB-Wax
Column length (m) 30.30.60.30.60.
Carrier gas H2 HeHeHe
Substrate
Column diameter (mm) 0.320.320.250.320.32
Phase thickness (μm) 0.50.50.250.250.25
Tstart (C) 40.40.60.40.35.
Tend (C) 280.280.240.180.220.
Heat rate (K/min) 6.6.5.5.3.
Initial hold (min) 5.5. 2.
Final hold (min) 5.5.30.
I 1590.1591.1607.1575.1587.
ReferenceJirovetz, Buchbauer, et al., 2005Jirovetz, Buchbauer, et al., 2005, 2Joichi, Yomogida, et al., 2005Ka, Choi, et al., 2005Palá-Paúl, Pérez-Alonso, et al., 2005
Comment MSDC-RI MSDC-RI MSDC-RI MSDC-RI MSDC-RI
Column type CapillaryCapillaryCapillaryCapillaryCapillary
Active phase CP-Wax 52CBCarbowaxSupelcowax-10ZB-WaxDB-Wax
Column length (m) 30.30.30.30.30.
Carrier gas He  HeliumHe
Substrate
Column diameter (mm) 0.320.250.250.320.25
Phase thickness (μm) 0.250.250.250.250.25
Tstart (C) 40.40.40.40.90.
Tend (C) 220.200.220.250.220.
Heat rate (K/min) 4.4.3.5.7.
Initial hold (min) 1. 5.2.2.
Final hold (min)   10.5.5.
I 1587.1606.1572.1576.1622.
ReferenceRohloff and Bones, 2005Szafranek, Chrapkowska, et al., 2005Vichi, Riu-Aumatell, et al., 2005N/AAgnihotri, Thappa, et al., 2004
Comment MSDC-RI MSDC-RI MSDC-RI MSDC-RI MSDC-RI
Column type CapillaryCapillaryCapillaryCapillaryCapillary
Active phase DB-WaxSupelcowax-10Supelcowax-10DB-WaxDB-Wax
Column length (m) 60.60.30.60.60.
Carrier gas N2HeN2HeHe
Substrate
Column diameter (mm) 0.250.20.250.250.25
Phase thickness (μm) 0.250.20.25
Tstart (C) 70.60.40.60.60.
Tend (C) 230.200.230.220.220.
Heat rate (K/min) 2.4.2.2.2.
Initial hold (min) 2.  4.4.
Final hold (min) 20.40.
I 1595.1566.1588.1586.1586.
ReferenceChoi, 2004Gauvin, Ravaomanarivo, et al., 2004González, Guerra, et al., 2004Jiang and Kubota, 2004Jiang and Kubota, 2004
Comment MSDC-RI MSDC-RI MSDC-RI MSDC-RI MSDC-RI
Column type CapillaryCapillaryCapillaryCapillaryCapillary
Active phase Carbowax 20MDB-WaxInnowaxHP-WaxBP-20
Column length (m) 30.60.50.30.25.
Carrier gas HeHeHeN2H2
Substrate
Column diameter (mm) 0.250.320.20.250.33
Phase thickness (μm) 0.250.250.20.250.5
Tstart (C) 60.35.70.60.80.
Tend (C) 250.220.220.220.220.
Heat rate (K/min) 3.3.4.5.5.
Initial hold (min)    10.
Final hold (min)
I 1633.1589.1584.1594.1606.
ReferenceLago, de Ávila, et al., 2004Palá-Paúl, Brophy, et al., 2004Palá-Paúl, García-Jiménez, et al., 2004Bertoli, Menichini, et al., 2003Dunlop, Bignell, et al., 2003
Comment MSDC-RI MSDC-RI MSDC-RI MSDC-RI MSDC-RI
Column type CapillaryCapillaryCapillaryCapillaryCapillary
Active phase HP-20MCP-Wax 52CBTC-WaxTC-WaxDB-Wax
Column length (m) 50.60.60.60.60.
Carrier gas HeHeHe Helium
Substrate
Column diameter (mm) 0.20.250.250.250.25
Phase thickness (μm) 0.20.25
Tstart (C) 70.40.80.80.70.
Tend (C) 180.220.240.240.210.
Heat rate (K/min) 4.3.3.3.2.
Initial hold (min) 4.
Final hold (min) 10.   60.
I 1570.1587.1593.1588.1596.
ReferenceMastelic and Jerkovic, 2003Mau, Lai, et al., 2003Miyazawa, Teranishi, et al., 2003Miyazawa, Yamafuji, et al., 2003Mookdasanit, Tamura, et al., 2003
Comment MSDC-RI MSDC-RI MSDC-RI MSDC-RI MSDC-RI
Column type CapillaryCapillaryCapillaryCapillaryCapillary
Active phase Carbowax 20MInnowaxDB-WaxRTX-WaxDB-Wax
Column length (m) 50.60.60.60.60.
Carrier gas N2HeN2HeH2
Substrate
Column diameter (mm) 0.250.250.250.250.32
Phase thickness (μm) 0.25 0.250.50.25
Tstart (C) 90.60.70.40.40.
Tend (C) 220.220.230.180.245.
Heat rate (K/min) 3.4.2.5.1.5
Initial hold (min)  10.2.5.
Final hold (min)  10.20.20.20.
I 1585.1600.1577.1617.1575.
ReferencePriestap, van Baren, et al., 2003Suleimenov, Atazharova, et al., 2003Tu, Onishi, et al., 2003Galindo-Cuspinera, Lubran, et al., 2002Gancel, Ollé, et al., 2002
Comment MSDC-RI MSDC-RI MSDC-RI MSDC-RI MSDC-RI
Column type CapillaryCapillaryCapillaryCapillaryCapillary
Active phase HP-WaxDB-WaxDB-WaxDB-WaxDB-Wax
Column length (m) 50.60.60.60.60.
Carrier gas N2N2N2HeHe
Substrate
Column diameter (mm) 0.250.250.250.250.25
Phase thickness (μm) 0.250.250.250.250.25
Tstart (C) 75.70.70.40.45.
Tend (C) 220.230.230.200.240.
Heat rate (K/min) 3.2.2.2.3.
Initial hold (min) 4.2. 2.
Final hold (min)  20.
I 1609.1585.1598.1570.1592.
ReferencePriestap, van Baren, et al., 2002Tu, Onishi, et al., 2002Tu, Thanh, et al., 2002Umano, Hagi, et al., 2002Christoph, 2001
Comment MSDC-RI MSDC-RI MSDC-RI MSDC-RI MSDC-RI
Column type CapillaryCapillaryCapillaryCapillaryCapillary
Active phase Carbowax 20MBP-20TC-WaxInnowaxBP-20
Column length (m) 30.50.60.60.25.
Carrier gas HeHeHeHeNitrogen
Substrate
Column diameter (mm) 0.250.220.250.250.50
Phase thickness (μm) 0.250.25 0.250.25
Tstart (C) 50.60.80.60.60.
Tend (C) 215.230.250.220.200.
Heat rate (K/min) 4.2.4.4.5.
Initial hold (min)    10.
Final hold (min)  35.47.10.
I 1591.1586.1591.1600.1584.
ReferenceKasali, Oyedeji, et al., 2001Lota, de Rocca Serra, et al., 2001Miyazawa, Kurose, et al., 2001Baser, Özek, et al., 2000Mallavarapu, Rao, et al., 2000
Comment MSDC-RI MSDC-RI MSDC-RI MSDC-RI MSDC-RI
Column type CapillaryCapillaryCapillaryCapillaryCapillary
Active phase DB-WaxBP-20HP Innowax FSPHP Innowax FSPInnowax
Column length (m) 60.25.60.60.60.
Carrier gas Nitrogen HeHeHe
Substrate
Column diameter (mm) 0.250.330.250.250.25
Phase thickness (μm)  0.50.250.250.25
Tstart (C) 40.80.60.60.60.
Tend (C) 200.220.220.220.220.
Heat rate (K/min) 2.5.
Initial hold (min) 10. 10.10.10.
Final hold (min)   10.10.
I 1598.1602.1600.1600.1600.
ReferenceTamura, Boonbumrung, et al., 2000Dunlop, Bignell, et al., 1999Kaya, Baser, et al., 1999Kaya, Baser, et al., 1999Kaya, Baser, et al., 1999, 2
Comment MSDC-RI MSDC-RI MSDC-RI MSDC-RI MSDC-RI
Column type CapillaryCapillaryCapillaryCapillaryCapillary
Active phase HP-InnowaxHP-InnowaxSupelcowax-10DB-WaxBP-20
Column length (m) 60.60.30.60.25.
Carrier gas HeHeHeHeN2
Substrate
Column diameter (mm) 0.250.250.250.250.5
Phase thickness (μm) 0.250.25 0.25
Tstart (C) 60.60.60.60.60.
Tend (C) 220.220.240.240.200.
Heat rate (K/min)   4.4.5.
Initial hold (min) 10.10.
Final hold (min)
I 1600.1600.1588.1598.1610.
ReferenceKaya, Baser, et al., 1999, 3Kaya, Baser, et al., 1999, 3Labuckas, Zygadlo, et al., 1999Ngassoum, Yonkeu, et al., 1999Rao, Bhattacharya, et al., 1999
Comment MSDC-RI MSDC-RI MSDC-RI MSDC-RI MSDC-RI
Column type CapillaryCapillaryCapillaryCapillaryCapillary
Active phase BP-20DB-WaxDB-WaxHP-InnowaxHP-Innowax FSC
Column length (m) 25.30.30.60.60.
Carrier gas H2N2N2HeHe
Substrate
Column diameter (mm) 0.330.250.250.250.25
Phase thickness (μm) 0.50.250.250.250.25
Tstart (C) 80.45.45.50.60.
Tend (C) 220.220.220.220.220.
Heat rate (K/min) 5.3.3.5.4.
Initial hold (min)    5.10.
Final hold (min)     10.
I 1602.1590.1600.1591.1600.
ReferenceBignell, Dunlop, et al., 1998Molleken U., Sinnwell V., et al., 1998Mölleken, Sinnwell, et al., 1998Stashenko, Cervantes, et al., 1998Tümen, Baser, et al., 1998
Comment MSDC-RI MSDC-RI MSDC-RI MSDC-RI MSDC-RI
Column type CapillaryCapillaryCapillaryCapillaryCapillary
Active phase HP-Innowax FSCBP-20BP-20BP-20BP-20
Column length (m) 60.25.25.25.25.
Carrier gas HeH2H2H2H2
Substrate
Column diameter (mm) 0.250.330.330.330.33
Phase thickness (μm)  0.50.50.50.5
Tstart (C) 60.80.80.80.80.
Tend (C) 240.220.220.220.220.
Heat rate (K/min) 4.5.5.5.5.
Initial hold (min) 10.
Final hold (min) 10.
I 1600.1602.1602.1602.1602.
ReferenceBaser, Kirimer, et al., 1997Bignell, Dunlop, et al., 1997Bignell, Dunlop, et al., 1997, 2Bignell, Dunlop, et al., 1997, 3Bignell, Dunlop, et al., 1997, 4
Comment MSDC-RI MSDC-RI MSDC-RI MSDC-RI MSDC-RI
Column type CapillaryCapillaryCapillaryCapillaryCapillary
Active phase BP-20BP-20SP-1000DB-WaxTC-Wax
Column length (m) 25.25.85.30.60.
Carrier gas  H2HeHe
Substrate
Column diameter (mm) 0.330.330.500.320.25
Phase thickness (μm) 0.50.5 0.5
Tstart (C) 80.80.65.40.80.
Tend (C) 220.220.225.210.240.
Heat rate (K/min) 5.5.3.3.3.
Initial hold (min)    1.5.
Final hold (min)    25.
I 1602.1602.1585.1578.1591.
ReferenceBignell, Dunlop, et al., 1997, 5Bignell, Dunlop, et al., 1997, 6Brophy, Goldsack, et al., 1996Pollak and Berger, 1996Shuichi, Masazumi, et al., 1996
Comment MSDC-RI MSDC-RI MSDC-RI MSDC-RI MSDC-RI
Column type CapillaryCapillaryCapillaryCapillaryCapillary
Active phase DB-WaxDB-WaxDB-WaxCarbowax 20MSupelcowax-10
Column length (m) 60.60.60.50.30.
Carrier gas HeliumHe H2
Substrate
Column diameter (mm) 0.320.250.320.32
Phase thickness (μm)  0.25 0.15
Tstart (C) 60.50.50.70.50.
Tend (C) 220.230.250.210.240.
Heat rate (K/min) 3.2.4.2.4.
Initial hold (min)  4.0.1 2.
Final hold (min)   5. 10.
I 1582.1583.1585.1580.1591.
ReferenceEveraerts, Roisin, et al., 1993Shimoda, Shiratsuchi, et al., 1993Binder and Flath, 1989Gaydou, Faure, et al., 1989Ramaswami, Briscese, et al., 1988
Comment MSDC-RI MSDC-RI MSDC-RI MSDC-RI MSDC-RI
Column type CapillaryCapillaryCapillary
Active phase Supelcowax-10Carbowax 20MCarbowax 20M
Column length (m) 30.100.100.
Carrier gas He
Substrate
Column diameter (mm)  0.250.25
Phase thickness (μm)
Tstart (C) 50.70.70.
Tend (C) 240.170.170.
Heat rate (K/min) 4.1.1.
Initial hold (min) 2.
Final hold (min) 10.
I 1591.1600.1606.
ReferenceRamaswami, Briscese, et al., 1986Shibamoto and Jennings, 1977Shibamoto and Jennings, 1977
Comment MSDC-RI MSDC-RI MSDC-RI

Kovats' RI, non-polar column, custom temperature program

Data compiled by: NIST Mass Spectrometry Data Center, William E. Wallace, director

Column type CapillaryCapillaryCapillaryCapillaryCapillary
Active phase BP-1BP-1BP-1BP-1OV-1
Column length (m) 25.25.25.30.15.
Carrier gas N2N2N2N2He
Substrate
Column diameter (mm) 0.250.250.320.320.317
Phase thickness (μm) 0.250.250.250.250.25
Program 60C => 5C/min => 220C(5min) => 3C/min => 245C(5min)60C => 5C/min => 220C (5min) => 3C/min => 245 C (5min)60C => 5C/min => 220C(5min) => 3C/min => 245C(5min)60C => 5.5C/min => 220C => 3.5C/min => 245C50C(4min) => (4C/min) => 90C => (10C/min)=300C(10min)
I 1386.1391.1383.1378.1381.
ReferenceDwivedi, Khan, et al., 2004Khan, Srivastava, et al., 2003Raina, Srivastava, et al., 2003Rao, Kaul, et al., 2003El-Shazly, Dorai, et al., 2002
Comment MSDC-RI MSDC-RI MSDC-RI MSDC-RI MSDC-RI
Column type CapillaryCapillaryCapillaryCapillaryCapillary
Active phase BP-1HP-5AT-5DB-5BP-1
Column length (m) 30.30.60.30.25.
Carrier gas N2H2He
Substrate
Column diameter (mm) 0.320.320.250.260.2
Phase thickness (μm) 0.250.250.250.25
Program 60 C 5 C/min -> 220 C (5 min) 3 C/min -> 245 C (5 min)60 0C (8 min) 3 K/min -> 180 0C 20 K/min (20 min)60 C 4K/min -> 200 C 10 K/min -> 280 Cnot specifiednot specified
I 1391.1405.1391.1391.1400.
ReferenceKhan, Srivastava, et al., 2002Frizzo, Serafini, et al., 2001Khouri, Usubillaga, et al., 2000Adams, 1998MacLeod, MacLeod, et al., 1988
Comment MSDC-RI MSDC-RI MSDC-RI MSDC-RI MSDC-RI
Column type CapillaryCapillary
Active phase SF-96SF-96
Column length (m) 127.150.
Carrier gas
Substrate
Column diameter (mm) 0.750.75
Phase thickness (μm)
Program not specifiednot specified
I 1404.1400.
ReferenceOkamoto, Ellison, et al., 1981Malingré and Maarse, 1974
Comment MSDC-RI MSDC-RI

Van Den Dool and Kratz RI, polar column, temperature ramp

Data compiled by: NIST Mass Spectrometry Data Center, William E. Wallace, director

Column type CapillaryCapillaryCapillaryCapillaryCapillary
Active phase BP-20BP-20BP-20RTX-WaxRTX-Wax
Column length (m) 50.50.50.60.60.
Carrier gas HeHeHeHeHe
Substrate
Column diameter (mm) 0.220.220.220.220.22
Phase thickness (μm) 0.250.250.250.250.25
Tstart (C) 60.60.60.60.60.
Tend (C) 220.220.220.230.230.
Heat rate (K/min) 2.2.2.2.2.
Initial hold (min)
Final hold (min) 20.20.20.30.35.
I 1589.1582.1583.1563.1589.
ReferenceBoti, Koukoua, et al., 2007Duquesnoy, Castola, et al., 2007Lesueur, de Rocca Serra, et al., 2007Muselli, Rossi, et al., 2007Paolini J., Costa J., et al., 2007
Comment MSDC-RI MSDC-RI MSDC-RI MSDC-RI MSDC-RI
Column type CapillaryCapillaryCapillaryCapillaryCapillary
Active phase HP-InnowaxBP-20BP-20HP-WaxBP-20
Column length (m) 30.50.50.30.50.
Carrier gas HeHeHeN2He
Substrate
Column diameter (mm) 0.250.220.220.250.22
Phase thickness (μm) 0.50.250.250.250.25
Tstart (C) 60.60.60.60.60.
Tend (C) 260.220.220.220.220.
Heat rate (K/min) 3.2.2.5.2.
Initial hold (min)    10.
Final hold (min)  20.20. 20.
I 1585.1588.1592.1593.1586.
ReferenceSaroglou, Marin, et al., 2007Boti, Bighelli, et al., 2006Duquesnoy, Dinh, et al., 2006Flamini, Tebano, et al., 2006Gonny, Cavaleiro, et al., 2006
Comment MSDC-RI MSDC-RI MSDC-RI MSDC-RI MSDC-RI
Column type CapillaryCapillaryCapillaryCapillaryCapillary
Active phase PEG-20MSupelcowax-10BP-20DB-WaxDB-Wax
Column length (m) 25.30.50.60.30.
Carrier gas HeHeHeN2He
Substrate
Column diameter (mm) 0.250.20.220.250.25
Phase thickness (μm) 0.30.20.250.250.25
Tstart (C) 50.70.60.70.40.
Tend (C) 220.220.220.230.250.
Heat rate (K/min) 3.3.2.2.3.
Initial hold (min) 1.  2.
Final hold (min) 5.15.20.20.20.
I 1584.1585.1590.1595.1573.
ReferenceRubiolo P., Matteodo M., et al., 2006Salgueiro L.R., Pinto E., et al., 2006Boti J.B., Koukoua G., et al., 2005Choi, 2005Fanciullino, Gancel, et al., 2005
Comment MSDC-RI MSDC-RI MSDC-RI MSDC-RI MSDC-RI
Column type CapillaryCapillaryCapillaryCapillaryCapillary
Active phase DB-WaxInnowaxRTX-WaxSupelcowax-10BP-20
Column length (m) 30.50.60.60.50.
Carrier gas HeHeHeHeHe
Substrate
Column diameter (mm) 0.250.250.220.20.22
Phase thickness (μm) 0.250.250.250.20.25
Tstart (C) 40.50.60.60.60.
Tend (C) 250.220.230.200.230.
Heat rate (K/min) 3.2.2.2.2.
Initial hold (min)  3.
Final hold (min) 20.20.35.10.35.
I 1575.1579.1589.1562.1589.
ReferenceGancel, Ollitrault, et al., 2005Lee, Lee, et al., 2005Paolini, Costa, et al., 2005Smadja, Rondeau, et al., 2005Vellutini, Baldovini, et al., 2005
Comment MSDC-RI MSDC-RI MSDC-RI MSDC-RI MSDC-RI
Column type CapillaryCapillaryCapillaryCapillaryCapillary
Active phase DB-WaxHP-WaxDB-WaxSupelcowax-10HP-Wax
Column length (m) 30.30.60.30.30.
Carrier gas N2N2HeHeN2
Substrate
Column diameter (mm) 0.250.250.320.20.25
Phase thickness (μm) 0.250.250.250.20.25
Tstart (C) 60.60.32.70.60.
Tend (C) 220.220.220.220.240.
Heat rate (K/min) 5.5.3.3.3.
Initial hold (min) 10.10.
Final hold (min)    15.
I 1590.1593.1589.1584.1588.
ReferenceBertoli, Menichini, et al., 2004Bertoli, Pistelli, et al., 2004Brophy, Goldsack, et al., 2004Cavaleiro, Salgueiro, et al., 2004Flamini, Cioni, et al., 2004
Comment MSDC-RI MSDC-RI MSDC-RI MSDC-RI MSDC-RI
Column type CapillaryCapillaryCapillaryCapillaryCapillary
Active phase HP-WaxHP-WaxHP-InnowaxBP-20HP-Wax
Column length (m) 30.30.30.50.30.
Carrier gas N2N2HeHeN2
Substrate
Column diameter (mm) 0.250.250.250.220.25
Phase thickness (μm) 0.250.250.50.250.25
Tstart (C) 60.60.60.60.60.
Tend (C) 240.220.260.220.220.
Heat rate (K/min) 3.5.3.2.5.
Initial hold (min)  10.  10.
Final hold (min)    20.
I 1588.1598.1598.1580.1598.
ReferenceFlamini, Cioni, et al., 2004Flamini, Luigi Cioni, et al., 2004Grujic-Jovanovic, Skaltsa, et al., 2004Tam, Thuam, et al., 2004Bader, Caponi, et al., 2003
Comment MSDC-RI MSDC-RI MSDC-RI MSDC-RI MSDC-RI
Column type CapillaryCapillaryCapillaryCapillaryCapillary
Active phase HP-WaxRTX-WaxDB-WaxDB-WaxHP-20M
Column length (m) 30.60.60.60.50.
Carrier gas N2HeN2H2He
Substrate
Column diameter (mm) 0.250.220.250.320.2
Phase thickness (μm) 0.250.250.250.250.2
Tstart (C) 60.60.70.40.70.
Tend (C) 220.230.230.245.180.
Heat rate (K/min) 5.2.2.1.54.
Initial hold (min) 10. 2. 4.
Final hold (min)  45.20.20.10.
I 1594.1585.1595.1575.1575.
ReferenceBader, Caponi, et al., 2003, 2Cavalli, Tomi, et al., 2003Choi, 2003Gancel, Ollitrault, et al., 2003Jerkovic, Mastelic, et al., 2003
Comment MSDC-RI MSDC-RI MSDC-RI MSDC-RI MSDC-RI
Column type CapillaryCapillaryCapillaryCapillaryCapillary
Active phase HP-InnowaxDB-WaxBP-20RTX-WaxAT-Wax
Column length (m) 30.60.50.30.60.
Carrier gas HeN2HeHeHe
Substrate
Column diameter (mm) 0.250.250.220.250.32
Phase thickness (μm) 0.50.250.250.250.25
Tstart (C) 60.70.60.45.65.
Tend (C) 260.230.220.250.250.
Heat rate (K/min) 3.2.2.3.2.
Initial hold (min)    6.10.
Final hold (min)  20.20.10.60.
I 1585.1598.1586.1560.1573.
ReferenceSkaltsa, Demetzos, et al., 2003Choi, Kim. M.-S.L., et al., 2002Lota, de Rocca Serra, et al., 2002Mondello, Zappia, et al., 2002Pino, Marbot, et al., 2002
Comment MSDC-RI MSDC-RI MSDC-RI MSDC-RI MSDC-RI
Column type CapillaryCapillaryCapillaryCapillaryCapillary
Active phase DB-WaxDB-WaxDB-WaxDB-WaxCP-Wax 52CB
Column length (m) 60.60.60.60.25.
Carrier gas HeHeHeHe
Substrate
Column diameter (mm) 0.50.500.530.530.25
Phase thickness (μm) 0.321.01.01.00.15
Tstart (C) 40.60.50.50.40.
Tend (C) 290.225.220.220.220.
Heat rate (K/min) 4.3.3.3.3.
Initial hold (min) 2.   5.
Final hold (min) 5.
I 1594.1585.1585.1585.1596.
ReferenceBartley and Jacobs, 2000Brophy, Goldsack, et al., 2000Brophy, Goldsack, et al., 2000, 2Brophy, Goldsack, et al., 2000, 3Chagonda, Makanda, et al., 2000
Comment MSDC-RI MSDC-RI MSDC-RI MSDC-RI MSDC-RI
Column type CapillaryCapillaryCapillaryCapillaryCapillary
Active phase DB-WaxBP-20BP-20MegawaxDB-Wax
Column length (m) 60.50.50.30.60.
Carrier gas N2HeHeHeHe
Substrate
Column diameter (mm) 0.250.220.220.250.53
Phase thickness (μm) 0.250.250.250.25
Tstart (C) 70.60.60.40.50.
Tend (C) 230.230.230.220.220.
Heat rate (K/min) 2.2.2.2.3.
Initial hold (min) 2.  6.
Final hold (min) 20.35.35.10.
I 1596.1586.1586.1559.1585.
ReferenceChoi and Sawamura, 2000Lota, de Rocca Serra, et al., 2000Lota, de Rocca Serra, et al., 2000Verzera, Trozzi, et al., 2000Brophy, Goldsack, et al., 1999
Comment MSDC-RI MSDC-RI MSDC-RI MSDC-RI MSDC-RI
Column type CapillaryCapillaryCapillaryCapillaryCapillary
Active phase InnowaxCarbowax 20MDB-WaxDB-WaxCarbowax 20M
Column length (m) 60.25.60.60.25.
Carrier gas HeH2HeHe
Substrate
Column diameter (mm) 0.250.250.320.320.25
Phase thickness (μm) 0.250.3  0.3
Tstart (C) 50.50.65.35.50.
Tend (C) 180.200.225.220.200.
Heat rate (K/min) 2.53.3.3.3.
Initial hold (min) 5.1.  1.
Final hold (min)  20.  20.
I 1591.1584.1585.1585.1584.
ReferenceStashenko, Cervantes, et al., 1999Bicchi, Rubiolo, et al., 1998Brophy, Goldsack, et al., 1998Brophy, Goldsack, et al., 1998, 2Bicchi, Fresia, et al., 1997
Comment MSDC-RI MSDC-RI MSDC-RI MSDC-RI MSDC-RI
Column type CapillaryCapillaryCapillaryCapillaryCapillary
Active phase DB-WaxSP-1000DB-WaxSupelcowax-10Carbowax 20M
Column length (m) 60.85.60.60.50.
Carrier gas HeHeHeHeHe
Substrate
Column diameter (mm) 0.320.50.320.250.2
Phase thickness (μm)   0.50.250.2
Tstart (C) 65.65.50.60.30.
Tend (C) 225.225.225.230.170.
Heat rate (K/min) 3.3.2.5.4.
Initial hold (min)    5.2.
Final hold (min)   20.20.20.
I 1585.1585.1602.1605.1562.
ReferenceBrophy, Goldsack, et al., 1997Brophy, Goldsack, et al., 1997, 2Sagrero-Nieves, Bartley, et al., 1997Granicher, Christen, et al., 1995Píry, Príbela, et al., 1995
Comment MSDC-RI MSDC-RI MSDC-RI MSDC-RI MSDC-RI
Column type CapillaryCapillaryCapillary
Active phase DB-WaxDB-WaxCarbowax 20M
Column length (m) 60.60.60.
Carrier gas He He
Substrate
Column diameter (mm) 0.200.250.32
Phase thickness (μm) 0.200.25
Tstart (C) 70.50.50.
Tend (C) 180.230.225.
Heat rate (K/min) 2.2.1.5
Initial hold (min) 5.4.
Final hold (min)  30.80.
I 1600.1583.1565.
ReferenceStashenko, Wiame, et al., 1995Shiratsuchi, Shimoda, et al., 1993Chen and Ho, 1988
Comment MSDC-RI MSDC-RI MSDC-RI

Kovats' RI, polar column, isothermal

Data compiled by: NIST Mass Spectrometry Data Center, William E. Wallace, director

Column type PackedPackedCapillary
Active phase Carbowax 20MCarbowax 20MCarbowax 20M
Column length (m) 7.37.3150.
Carrier gas
Substrate
Column diameter (mm)  3.170.75
Phase thickness (μm)
Temperature (C) 150.165.130.
I 1608.1627.1608.
ReferenceAndersen, Bissonette, et al., 1977Ohta, Andersen, et al., 1977Malingré and Maarse, 1974
Comment MSDC-RI MSDC-RI MSDC-RI

References

Benkaci-Ali, Baaliouamer, et al., 2007
Benkaci-Ali, F.; Baaliouamer, A.; Meklati, B.Y.; Chemat, F., Chemical composition of seed essential oils from Algerian Nigella sativa extracted by microwave and hydrodistillation, Flavour Fragr. J., 2007, 22, 2, 148-153, https://doi.org/10.1002/ffj.1773 . [all data]

Boti, Koukoua, et al., 2007
Boti, J.B.; Koukoua, G.; N'Guessan, T.Y.; Casanova, J., Chemical variability of Conyza sumatrensis and Microglossa pyrifolia from Côte d'Ivoire, Flavour Fragr. J., 2007, 22, 1, 27-31, https://doi.org/10.1002/ffj.1743 . [all data]

Cunicao, Lopes, et al., 2007
Cunicao, M.M.; Lopes, A.R.; Côcco, L.C.; Yamamoto, C.I.; Plocharski, R.C.B.; Miguel, M.D.; Junior, A.G.; Auer, C.G.; Miguel, O.G., Phytochemical and antibacterial evaluation of essential oils from Ottonia Martiana Miq. (Piperaceae), J. Braz. Chem. Soc., 2007, 18, 1, 184-188, https://doi.org/10.1590/S0103-50532007000100021 . [all data]

Dehghan, Solaimanian, et al., 2007
Dehghan, G.; Solaimanian, R.; Shahverdi, A.R.; Amin, G.; Abdollahi, M.; Shafiee, A., Chemical composition and antimicrobial activity of essential oil of Ferula szovitsiana D.C., Flavour Fragr. J., 2007, 22, 3, 224-227, https://doi.org/10.1002/ffj.1789 . [all data]

Duquesnoy, Castola, et al., 2007
Duquesnoy, E.; Castola, V.; Casanova, J., Composition and chemical variability of the twig oil of Abies alba Miller from Corsica, Flavour Fragr. J., 2007, 22, 4, 293-299, https://doi.org/10.1002/ffj.1796 . [all data]

Flamini, Tebano, et al., 2007
Flamini, G.; Tebano, M.; Cioni, P.L.; Ceccarini, L.; Ricci, A.S.; Longo, I., Comparison between the conventional method of extraction of essential oil of Laurus nobilis L. and a novel method which uses microwaves applied in situ, without resorting to an oven, J. Chromatogr. A, 2007, 1143, 1-2, 36-40, https://doi.org/10.1016/j.chroma.2007.01.031 . [all data]

Lesueur, de Rocca Serra, et al., 2007
Lesueur, D.; de Rocca Serra, D.; Bighelli, A.; Hoi, T.M.; Ban, N.K.; Thai, T.H.; Casanova, J., Chemical composition and antibacterial activity of the essential oil of Michelia foveolata Merryll ex Dandy from Vietnam, Flavour Fragr. J., 2007, 22, 4, 317-321, https://doi.org/10.1002/ffj.1799 . [all data]

Martins, Santos, et al., 2007
Martins, F.T.; Santos, M.H.; Polo, M.; Barbosa, L.C.A., Effects of the interactions among macronutrients, plant age and photoperiod in the composition of Hyptis suaveolens (L.) Poit essential oil from Alfenas (MG), Brazil, Flavour Fragr. J., 2007, 22, 2, 123-129, https://doi.org/10.1002/ffj.1769 . [all data]

Melo, Corrêa, et al., 2007
Melo, R.M.; Corrêa, V.F.S.; Amorim, A.C.L.; Miranda, A.L.P.; Rezende, C.M., Identification of Impact Aroma Compounds in Eugenia uniflora L. (Brazilian Pitanga) Leaf Essential Oil, J. Braz. Chem. Soc., 2007, 18, 1, 179-183, https://doi.org/10.1590/S0103-50532007000100020 . [all data]

Muselli, Rossi, et al., 2007
Muselli, A.; Rossi, P.-G.; Desjobert, J.-M.; Bernardini, A.-F.; Berti, L.; Costa, J., Chemical composition and antibacterial activity of Otanthus maritimus (L.) Hoffmanns. Link essential oils from Corsica, Flavour Fragr. J., 2007, 22, 3, 217-223, https://doi.org/10.1002/ffj.1787 . [all data]

Paolini J., Costa J., et al., 2007
Paolini J.; Costa J.; Bernardini A.F., Analysis of the essential oil from the roots of Eupatorium cannabinum subsp corsicum (L.) by GC, GC-MS and C-13-NMR, Phytochem. Anal., 2007, 18, 3, 235-244, https://doi.org/10.1002/pca.977 . [all data]

Politeo, Jukic, et al., 2007
Politeo, O.; Jukic, M.; Milos, M., Chemical composition and antioxidant capacity of free volatile aglycones from basil (Ocimum basilicum L.) compared with its essential oil, Food Chem., 2007, 101, 1, 379-385, https://doi.org/10.1016/j.foodchem.2006.01.045 . [all data]

Quijano, Salamanca, et al., 2007
Quijano, C.E.; Salamanca, G.; Pino, J.A., Aroma volatile constituents of Colombian varieties of mango (Mangifera indica L.), Flavour Fragr. J., 2007, 22, 5, 401-406, https://doi.org/10.1002/ffj.1812 . [all data]

Radulovic, Lazarevic, et al., 2007
Radulovic, N.; Lazarevic, J.; Ristic, N.; Palic, R., Chemotaxonomic significance of the volatiles in the genus Stachys (Lamiaceae): Essential oil composition of four Balkan Stachys species, Biochem. Syst. Ecol., 2007, 35, 4, 196-208, https://doi.org/10.1016/j.bse.2006.10.010 . [all data]

Rout, Rao, et al., 2007
Rout, P.K.; Rao, Y.R.; Sree., A.; Naik, S.N., Composition of essential oil, concrete, absolute, wax and headspace volatiles of Murrarya paniculata (Linn.) Jack flowers, Flavour Fragr. J., 2007, 22, 5, 352-357, https://doi.org/10.1002/ffj.1804 . [all data]

Sabulal, Dan, et al., 2007
Sabulal, B.; Dan, M.; John, A.; Kurup, R.; Chandrika, S.P.; George, V., Phenylbutanoid-rich rhizome oil of Zingiber neesanum from Western Ghats, southern India, Flavour Fragr. J., 2007, 22, 6, 521-524, https://doi.org/10.1002/ffj.1834 . [all data]

Saroglou, Marin, et al., 2007
Saroglou, V.; Marin, P.D.; Rancic, A.; Veljic, M.; Skaltsa, H., Composition and antimicrobial activity of the essential oil of six Hypericum species from Serbia, Biochem. Syst. Ecol., 2007, 35, 3, 146-152, https://doi.org/10.1016/j.bse.2006.09.009 . [all data]

Simoniatto, Bonani, et al., 2007
Simoniatto, E.; Bonani, V.F.L.; Morel, A.F.; Poppi, N.R.; Raposo, J.L., Jr.; Stuker, C.Z.; Peruzzo, G.M.; Peres, M.T.L.P.; Hess, S.C., Chemical composition and evaluation of antibacterial and antioxidant activities of the essential oil of Croton urucurana Baillon (Euphorbiaceae) stem bark, J. Braz. Chem., 2007, 18, 5, 879-885, https://doi.org/10.1590/S0103-50532007000500002 . [all data]

Telascrea, de Araujo, et al., 2007
Telascrea, M.; de Araujo, C.C.; Marques, M.O.M.; Facanali, R.; de Moraes, P.L.R.; Cavalheiro, A.J., Essential oil from leaves of Cryptocarya mandioccana Meisner (Lauraceae): Composition and intraspecific chemical variability, Biochem. Syst. Ecol., 2007, 35, 4, 222-232, https://doi.org/10.1016/j.bse.2006.09.015 . [all data]

Vagionas, Ngassapa, et al., 2007
Vagionas, K.; Ngassapa, O.; Runyoro, D.; Graikou, K.; Gortzi, O.; Chinou, I., Chemical analysis of edible aromatic plants growing in Tanzania, Food Chem., 2007, 105, 4, 1711-1717, https://doi.org/10.1016/j.foodchem.2007.05.029 . [all data]

Yu, Liao, et al., 2007
Yu, J.Q.; Liao, Z.X.; Cai, X.Q.; Lei, J.C.; Zou, G.L., Composition, antimicrobial activity and cytotoxicity of essential oils from Aristolochia mollissima, Environmental Toxicology and Pharmacology, 2007, 23, 2, 162-167, https://doi.org/10.1016/j.etap.2006.08.004 . [all data]

Basta, Tzakou, et al., 2006
Basta, A.; Tzakou, O.; Couladis, M., The essential oil composition of Phlomis cretica C. Presl, Flavour Fragr. J., 2006, 21, 5, 795-797, https://doi.org/10.1002/ffj.1717 . [all data]

Blagojevic, Radulovic, et al., 2006
Blagojevic, P.; Radulovic, N.; Palic, R.; Stojanovic, G., Chemical composition of the essential oils of Serbian wild-growing Srtemisia absinthium and Artemisia vulgaris, J. Agric. Food Chem., 2006, 54, 13, 4780-4789, https://doi.org/10.1021/jf060123o . [all data]

Boti, Bighelli, et al., 2006
Boti, J.B.; Bighelli, A.; Cavaleiro, C.; Salgueiro, L.; Casanova, J., Chemical variability of Juniperus oxycedrus ssp. oxycedrus berry and leaf oils from Corsica, analysed by combination of GC, GC-MS and 13C-NMR, Flavour Fragr. J., 2006, 21, 2, 268-273, https://doi.org/10.1002/ffj.1579 . [all data]

Dob, Dahmane, et al., 2006
Dob, T.; Dahmane, D.; Chelghoum, C., Essential oil composition of Juniperus oxycedrus growing in Algeria, Pharm. Biol., 2006, 44, 1, 1-6, https://doi.org/10.1080/13880200500530922 . [all data]

Duquesnoy, Dinh, et al., 2006
Duquesnoy, E.; Dinh, N.H.; Castola, V.; Casanova, J., Composition of a Pyrolytic oil from Cupressus funebris Endl. of Vietnamese origin, Flavour Fragr. J., 2006, 21, 3, 453-457, https://doi.org/10.1002/ffj.1676 . [all data]

Flamini, Tebano, et al., 2006
Flamini, G.; Tebano, M.; Cioni, P.L.; Bagci, Y.; Dural, H.; Ertugrul, K.; Uysal, T.; Savran, A., A multivariate statistical approach to Centaurea classification using essential oil composition data of some species from Turkey, Pl. Syst. Evol., 2006, 261, 1-4, 217-228, https://doi.org/10.1007/s00606-006-0448-3 . [all data]

Gonny, Cavaleiro, et al., 2006
Gonny, M.; Cavaleiro, C.; Salgueiro, L.; Casanova, J., Analysis of Juniperus communis subsp. alpina needle, berry, wood and root oils by combination of GC, GC/MS and 13C-NMR, Flavour Fragr. J., 2006, 21, 1, 99-106, https://doi.org/10.1002/ffj.1527 . [all data]

Kuiate, Bessière, et al., 2006
Kuiate, J.R.; Bessière, J.M.; Vilarem, G.; Amvam Zollo, P.H., Chemical composition and antidermatophytic properties of the essential oils from leaves, flowers and fruits of Cupressus lusitanica Mill. from Cameroon, Flavour Fragr. J., 2006, 21, 4, 693-697, https://doi.org/10.1002/ffj.1686 . [all data]

Kukic J., Petrovic S., et al., 2006
Kukic J.; Petrovic S.; Pavlovic M.; Couladis M.; Tzakou O.; Niketic M., Composition of essential oil of Stachys alpina L. ssp dinarica Murb., Flavour Fragr. J., 2006, 21, 3, 539-542, https://doi.org/10.1002/ffj.1684 . [all data]

Masoudi, Esmaeili, et al., 2006
Masoudi, S.; Esmaeili, A.; Khalilzadeh, M.A.; Rustaiyan, A.; Moazami, N.; Akhgar, M.R.; Varavipoor, M., Volatile constituents of Dorema aucheri Boiss., Seseli libanotis (L.) W. D. Koch var. armeniacum bordz. and Conium maculatum L. three Umbelliferae herbs growing wild in Iran, Flavour Fragr. J., 2006, 21, 5, 801-804, https://doi.org/10.1002/ffj.1722 . [all data]

Pavlovic, Kovacevic, et al., 2006
Pavlovic, M.; Kovacevic, N.; Tzakou, O.; Couladis, M., Essential oil composition of Anthemis triumfetti (L.) DC., Flavour Fragr. J., 2006, 21, 2, 297-299, https://doi.org/10.1002/ffj.1592 . [all data]

Pavlovic, Tzakou, et al., 2006
Pavlovic, M.; Tzakou, O.; Petrakis, P.V.; Couladis, M., The essential oil of Hypericum perforatum L., Hypericum tetrapterum Fries and Hypericum olympicum L. growing in Greece, Flavour Fragr. J., 2006, 21, 1, 84-87, https://doi.org/10.1002/ffj.1521 . [all data]

Perraudin, Popovici, et al., 2006
Perraudin, F.; Popovici, J.; Bertrand, C., Analysis of headspace-solid microextracts from flowers of Maxillaria tenuifolia Lindl. by GC-MS, Electronic Journal of Natural Substances, 2006, 1, 1-5. [all data]

Radulovic, Mananjarasoa, et al., 2006
Radulovic, N.; Mananjarasoa, E.; Harinantenaina, L.; Yoshinori, A., Essential oil composition of four Croton species from Madagascar and their chemotaxonomy, Biochem. Syst. Ecol., 2006, 34, 8, 648-653, https://doi.org/10.1016/j.bse.2006.02.005 . [all data]

Rezazadeh, Hamedani, et al., 2006
Rezazadeh, S.; Hamedani, M.P.; Dowlatabadi, R.; Yazdani, D.; Shafiee, A., Chemical composition of the essential oils of Stachys schtschegleevii Sosn. and Stachys balansae Boiss Kotschy from Iran, Flavour Fragr. J., 2006, 21, 2, 290-293, https://doi.org/10.1002/ffj.1587 . [all data]

Rubiolo P., Matteodo M., et al., 2006
Rubiolo P.; Matteodo M.; Riccio G.; Ballero M.; Christen P.; Fleury-Souverain S.; Veuthey J.L.; Bicchi C., Analytical discrimination of poisonous and nonpoisonous chemotypes of giant fennel (Ferula communis L.) through their biologically active and volatile fractions, J. Agric. Food Chem., 2006, 54, 20, 7556-7563, https://doi.org/10.1021/jf061592t . [all data]

Salgueiro L.R., Pinto E., et al., 2006
Salgueiro L.R.; Pinto E.; Goncalves M.J.; Costa I.; Palmeira A.; Cavaleiro C.; Pina-Vaz C.; Rodrigues A.G.; Martinez-De-Oliveira J., Antifungal activity of the essential oil of Thymus capitellatus against Candida, Aspergillus and dermatophyte strains, Flavour Fragr. J., 2006, 21, 5, 749-753, https://doi.org/10.1002/ffj.1610 . [all data]

Saroglou, Dorizas, et al., 2006
Saroglou, V.; Dorizas, N.; Kypriotakis, Z.; Skaltsa, H.D., Analysis of the essential oil composition of eight Anthemis species from Greece, J. Chromatogr. A, 2006, 1104, 1-2, 313-322, https://doi.org/10.1016/j.chroma.2005.11.087 . [all data]

Silva-Brandão, Solferini, et al., 2006
Silva-Brandão, K.L.; Solferini, V.N.; Trigo, J.R., Chemical and phylogenetic relationships among Aristolochia L. (Aristolochiaceae) from southeastern Brazil, Biochem. Syst. Ecol., 2006, 34, 4, 291-302, https://doi.org/10.1016/j.bse.2005.10.011 . [all data]

Su, Ho, et al., 2006
Su, Y.C.; Ho, C.L.; Wang, E.I.C., Analysis of leaf essential oils from the indigenous five conifers of Taiwan, Flavour Fragr. J., 2006, 21, 3, 447-452, https://doi.org/10.1002/ffj.1685 . [all data]

Su, Ho, et al., 2006, 2
Su, Y.-C.; Ho, C.-L.; Wang, E.I.-C.; Chang, S.-T., Antifungal activities and chemical compositions of essential oils from leaves of four eucalypts, Taiwan J. For. Sci., 2006, 21, 1, 49-61. [all data]

Vujisic L., Vuckovic I., et al., 2006
Vujisic L.; Vuckovic I.; Tesevic V.; Dokovic D.; Ristic M.S.; Janackovic P.; Milosavljevic S., Comparative examination of the essential oils of Anthemis ruthenica and A-arvensis wild-growing in Serbia, Flavour Fragr. J., 2006, 21, 3, 458-461, https://doi.org/10.1002/ffj.1681 . [all data]

Vundac, Pfeifhofer, et al., 2006
Vundac, V.B.; Pfeifhofer, H.W.; Brantner, A.H.; Males, Z.; Plazibat, M., Essential oils of seven Stachys taxa from Croatia, Biochem. Syst. Ecol., 2006, 34, 12, 875-881, https://doi.org/10.1016/j.bse.2006.04.010 . [all data]

Zhao J.Y., Liu J.M., et al., 2006
Zhao J.Y.; Liu J.M.; Zhang X.Y.; Liu Z.J.; Tsering T.; Zhong Y.; Nan P., Chemical composition of the volatiles of three wild Bergenia species from western China, Flavour Fragr. J., 2006, 21, 3, 431-434, https://doi.org/10.1002/ffj.1689 . [all data]

Agnaniet, Makani, et al., 2005
Agnaniet, H.; Makani, T.; Akagah, A.; Menut, C.; Bessière, J.M., Volatile constituents and antioxidant activity of essential oils from Lippia multiflora Mold. growing in Gabon, Flavour Fragr. J., 2005, 20, 1, 34-38, https://doi.org/10.1002/ffj.1383 . [all data]

Boti J.B., Koukoua G., et al., 2005
Boti J.B.; Koukoua G.; N'Guessan T.Y.; Muselli A.; Bernardini A.F.; Casanova J., Composition of the leaf, stem bark and root bark oils of Isolona cooperi investigated by GC (retention index), GC-MS and C-13-NMR spectroscopy, Phytochem. Anal., 2005, 16, 5, 357-363, https://doi.org/10.1002/pca.857 . [all data]

Brantner, Pfeifhofer, et al., 2005
Brantner, A.H.; Pfeifhofer, H.W.; Ercegovac, O.; Males, Z.; Plazibat, M., Essential oil composition and antioxidant activity of Thymus bracteosus Vis. ex Benth., Flavour Fragr. J., 2005, 20, 6, 596-600, https://doi.org/10.1002/ffj.1494 . [all data]

Choi, 2005
Choi, H.-S., Characteristic odor components of kumquat (Fortunella japonica Swingle) peel oil, J. Agric. Food Chem., 2005, 53, 5, 1642-1647, https://doi.org/10.1021/jf040324x . [all data]

Cioni, Flamini, et al., 2005
Cioni, P.L.; Flamini, G.; Caponi, C.; Ceccarini, L.; Morelli, I., Analysis of volatile fraction, fixed oil and tegumental waxes of the seeds of two different cultivars of Helianthus annuus, Food Chem., 2005, 90, 4, 713-717, https://doi.org/10.1016/j.foodchem.2004.04.031 . [all data]

Dugo, Mondello, et al., 2005
Dugo, P.; Mondello, L.; Favoino, O.; Cicero, L.; Rodriguez Zenteno, N.A.; Dugo, G., Characterization of cold-pressed Mexican dancy tangerine oils, Flavour Fragr. J., 2005, 20, 1, 60-66, https://doi.org/10.1002/ffj.1367 . [all data]

Fanciullino, Gancel, et al., 2005
Fanciullino, A.-L.; Gancel, A.-L.; Froelicher, Y.; Luro, F.; Ollitrault, P.; Brillouet, J.-M., Effects of Nucleo-cytoplasmic Interactions on Leaf Volatile Compounds from Citrus Somatic Diploid Hybrids, J. Agric. Food Chem., 2005, 53, 11, 4517-4523, https://doi.org/10.1021/jf0502855 . [all data]

de Feo, Urrunaga Soria, et al., 2005
de Feo, V.; Urrunaga Soria, E.; Urrunaga Soria, R.; Pizza, C., Composition and in vitro toxicity of the essential oil of Tagetes terniflora HBK. (Asteraceae), Flavour Fragr. J., 2005, 20, 1, 89-92, https://doi.org/10.1002/ffj.1379 . [all data]

Flamini, Luigi Cioni, et al., 2005
Flamini, G.; Luigi Cioni, P.; Morelli, I., Composition of the essential oils and in vivo emission of volatiles of four Lamium species from Italy: L. purpureum, L. hybridum, L. bifidum and L. amplexicaule, Food Chem., 2005, 91, 1, 63-68, https://doi.org/10.1016/j.foodchem.2004.05.047 . [all data]

Gancel, Ollitrault, et al., 2005
Gancel, A.-L.; Ollitrault, P.; Froelicher, Y.; Tomi, F.; Jacquemond, C.; Luro, F.; Brillouet, J.-M., Leaf volatile compounds of six citrus somatic allotetraploid hybrids originating from various combinations of lime, lemon, citron, sweet orange, and grapefruit, J. Agric. Food Chem., 2005, 53, 6, 2224-2230, https://doi.org/10.1021/jf048315b . [all data]

Idzojtic, Kajba, et al., 2005
Idzojtic, M.; Kajba, D.; Franjic, J., Differentiation of F1 hybrids P. nigra J. F. Arnold × P. sylvestris L., P. nigra J. F. Arnold × P. densiflora Siebold et Zucc., P. nigra J. F. Arnold × P. thunbergiana Franco and their parental species by needle volatile composition, Biochem. Syst. Ecol., 2005, 33, 4, 427-439, https://doi.org/10.1016/j.bse.2004.10.008 . [all data]

bin Jantan, Yalvema, et al., 2005
bin Jantan, I.; Yalvema, M.F.; Ahmad, N.W.; Jamal, J.A., Insecticidal activities of the leaf oils of eight Cinnamomum species against Aedes aegypti and Aedes albopictus, Pharm. Biol., 2005, 43, 6, 526-532, https://doi.org/10.1080/13880200500220771 . [all data]

bin Jantan, Yalvema, et al., 2005, 2
bin Jantan, I.; Yalvema, M.F.; Ayop, N.; Ahmad, A.S., Constituents of the essential oils of Cinnamomum sintoc Blume from a mountain forest of Peninsular Malaysia, Flavour Fragr. J., 2005, 20, 6, 601-604, https://doi.org/10.1002/ffj.1495 . [all data]

Javidnia, Miri, et al., 2005
Javidnia, K.; Miri, R.; Mehregan, I.; Sadeghpour, H., Volatile constituents of the essential oil of Nepeta ucrainica L. ssp. kopetdaghensis from Iran, Flavour Fragr. J., 2005, 20, 2, 219-221, https://doi.org/10.1002/ffj.1381 . [all data]

Javidnia, Miri, et al., 2005, 2
Javidnia, K.; Miri, R.; Jamalian, A., Composition of the essential oil of Salvia macrosiphon Boiss. from Iran, Flavour Fragr. J., 2005, 20, 5, 542-543, https://doi.org/10.1002/ffj.1468 . [all data]

Magalhães, Ruiz, et al., 2005
Magalhães, A.F.; Ruiz, A.L.T.G.; Flach, A.; Faria, A.D.; Magalhães, E.G.; Amaral, M.C.E., Floral scent of Eleocharis elegans (Kunth) Roem. Schult. (Cyperaceae), Biochem. Syst. Ecol., 2005, 33, 7, 675-679, https://doi.org/10.1016/j.bse.2004.12.004 . [all data]

Paolini, Costa, et al., 2005
Paolini, J.; Costa, J.; Bernardini, A., Analysis of the essential oil from aerial parts of Eupatorium cannabinum subsp. corsicum (L.) by gas chromatography with electron impact and chemical ionization mass spectrometry, J. Chromatogr. A, 2005, 1076, 1-2, 170-178, https://doi.org/10.1016/j.chroma.2005.03.131 . [all data]

Pino, Mesa, et al., 2005
Pino, J.A.; Mesa, J.; Muñoz, Y.; Martí, M.P.; Marbot, R., Volatile components from mango (Mangifera indica L.) cultivars, J. Agric. Food Chem., 2005, 53, 6, 2213-2223, https://doi.org/10.1021/jf0402633 . [all data]

Senatore, Napolitano, et al., 2005
Senatore, F.; Napolitano, F.; Arnold, N.A.; Bruno, M.; Herz, W., Composition and antimicrobial activity of the essential oil of Achillea falcata L. (Asteraceae), Flavour Fragr. J., 2005, 20, 3, 291-294, https://doi.org/10.1002/ffj.1411 . [all data]

Seo and Baek, 2005
Seo, W.H.; Baek, H.H., Identification of characteristic aroma-active compounds from water dropword (Oenanthe javanica DC.), J. Agric. Food Chem., 2005, 53, 17, 6766-6770, https://doi.org/10.1021/jf050150z . [all data]

Smadja, Rondeau, et al., 2005
Smadja, J.; Rondeau, P.; Sing, A.S.C., Volatile constituents of five Citrus Petitgrain essential oils from Reunion, Flavour Fragr. J., 2005, 20, 4, 399-402, https://doi.org/10.1002/ffj.1438 . [all data]

Tchoumbougnang, Zollo, et al., 2005
Tchoumbougnang, F.; Zollo, P.H.A.; Boyom, F.F.; Nyegue, M.A.; Bessière, J.M.; Menut, C., Aromatic plants of tropical Central Africa. XLVIII. Comparative study of the essential oils of four Hyptis species from Cameroon: H. lanceolata Poit., H. pectinata (L.) Poit., H. spicigera Lam. and H. suaveolens Poit., Flavour Fragr. J., 2005, 20, 3, 340-343, https://doi.org/10.1002/ffj.1441 . [all data]

Vellutini, Baldovini, et al., 2005
Vellutini, M.; Baldovini, N.; de Rocca Serra, D. Tomi; Casanova, J., β-Cyclolavandulyl and β-isocyclolavandulyl esters from Peucedanum paniculatum L., an endemic species to Corsica, Phytochemistry, 2005, 66, 16, 1956-1962, https://doi.org/10.1016/j.phytochem.2005.07.001 . [all data]

Adams, Habte, et al., 2004
Adams, R.P.; Habte, M.; Park, S.; Dafforn, M.R., Preliminary comparison of vetiver root essential oils from cleansed (bacteria- and fungus-free) versus non-cleansed (normal) vetiver plants, Biochem. Syst. Ecol., 2004, 32, 12, 1137-1144, https://doi.org/10.1016/j.bse.2004.03.013 . [all data]

Aligiannis, Kalpoutzakis, et al., 2004
Aligiannis, N.; Kalpoutzakis, E.; Kyriakopoulou, I.; Mitaku, S.; Chinou, I.B., Essential oils of Phlomis species growing in Greece: chemical composition and antimicrobial activity, Flavour Fragr. J., 2004, 19, 4, 320-324, https://doi.org/10.1002/ffj.1305 . [all data]

Antunes, Sevinate-Pinto, et al., 2004
Antunes, T.; Sevinate-Pinto, I.; Barroso, J.G.; Cavaleiro, C.; Salgueiro, L.R., Micromorphology of trichomes and composition of essential oil of Teucrium capitatum, Flavour Fragr. J., 2004, 19, 4, 336-340, https://doi.org/10.1002/ffj.1310 . [all data]

Bertoli, Menichini, et al., 2004
Bertoli, A.; Menichini, F.; Noccioli, C.; Morelli, I.; Pistelli, L., Volatile constituents of different organs of Psoralea bituminosa L., Flavour Fragr. J., 2004, 19, 2, 166-171, https://doi.org/10.1002/ffj.1315 . [all data]

Bertoli, Pistelli, et al., 2004
Bertoli, A.; Pistelli, L.; Morelli, I.; Fraternale, D.; Giamperi, L.; Ricci, D., Volatile constituents of different parts (roots, stems and leaves) of Smyrnium olusatrum L., Flavour Fragr. J., 2004, 19, 6, 522-525, https://doi.org/10.1002/ffj.1382 . [all data]

Cavaleiro, Salgueiro, et al., 2004
Cavaleiro, C.; Salgueiro, L.R.; Miguel, M.G.; da Cunha, A.P., Analysis by gas chromatography?mass spectrometry of the volatile components of Teucrium lusitanicum and Teucrium algarbiensis, J. Chromatogr. A, 2004, 1033, 1, 187-190, https://doi.org/10.1016/j.chroma.2004.01.005 . [all data]

Ceccarini, Macchia, et al., 2004
Ceccarini, L.; Macchia, M.; Flamini, G.; Cioni, P.L.; Caponi, C.; Morelli, I., Essential oil composition of Helianthus annuus L. leaves and heads of two cultivated hybride Carlos and Florom 350, Ind. Crops Prod., 2004, 19, 1, 13-17, https://doi.org/10.1016/S0926-6690(03)00076-1 . [all data]

Chorianopoulos, Kalpoutzakis, et al., 2004
Chorianopoulos, N.; Kalpoutzakis, E.; Aligiannis, N.; Mitaku, S.; Nychas, G.-J.; Haroutounian, S.A., Essential oils of Satureja, Origanum, and Thymus species: chemical composition and antibacterial activities against foodborne pathogens, J. Agric. Food Chem., 2004, 52, 26, 8261-8267, https://doi.org/10.1021/jf049113i . [all data]

Flamini, Cioni, et al., 2004
Flamini, G.; Cioni, P.L.; Morelli, I.; Maccioni, S.; Baldini, R., Phytochemical typologies in some populations of Myrtus communis L. on Caprione Promontory (East Liguria, Italy), Food Chem., 2004, 85, 4, 599-604, https://doi.org/10.1016/j.foodchem.2003.08.005 . [all data]

Flach A., Dondon R.C., et al., 2004
Flach A.; Dondon R.C.; Singer R.B.; Koehler S.; Amaral M.D.E.; Marsaioli A.J., The chemistry of pollination in selected Brazilian maxillariinae orchids: Floral rewards and fragrance, J. Chem. Ecol., 2004, 30, 5, 1045-1056, https://doi.org/10.1023/B:JOEC.0000028466.50392.ed . [all data]

Flamini, Luigi Cioni, et al., 2004
Flamini, G.; Luigi Cioni, P.; Morelli, I., Essential oils of Galeopsis pubescens and G. tetrahit from Tuscany (Italy), Flavour Fragr. J., 2004, 19, 4, 327-329, https://doi.org/10.1002/ffj.1307 . [all data]

Grujic-Jovanovic, Skaltsa, et al., 2004
Grujic-Jovanovic, S.; Skaltsa, H.D.; Marin, P.; Sokovic, M., Composition and antibacterial activity of the essential oil of six Stachys species from Serbia, Flavour Fragr. J., 2004, 19, 2, 139-144, https://doi.org/10.1002/ffj.1275 . [all data]

Javidnia, Miri, et al., 2004
Javidnia, K.; Miri, R.; Jafari, A.; Rezai, H., Analysis of the volatile constituents of Nepeta macrosiphon Boiss. grown in Iran, Flavour Fragr. J., 2004, 19, 2, 156-158, https://doi.org/10.1002/ffj.1287 . [all data]

Karioti, Hadjipavlou-Litina, et al., 2004
Karioti, A.; Hadjipavlou-Litina, D.; Mensah, M.L.K.; Fleischer, T.C.; Skaltsa, H., Composition and antioxidant activity of the essential oils of Xylopia aethiopica (Dun) A. Rich. (Annonaceae) leaves, stem bark, root bark, and fresh and dried fruits, growing in Ghana, J. Agric. Food Chem., 2004, 52, 26, 8094-8098, https://doi.org/10.1021/jf040150j . [all data]

Mardarowicz, Wianowska, et al., 2004
Mardarowicz, M.; Wianowska, D.; Dawidowicz, A.L.; Sawicki, R., The influence of sample treatment on SPME extracts from conifers. I. Comparison of terpene composition in Engelmann Spruce (Picea engelmanii) using hydrodistillation, SPME and PLE, Annales Universitatis Mariae Curie-Sklodowska Lublin - Polonia, 2004, 59, 3, 25-42. [all data]

Moldão-Martins, Beirão-da-Costa, et al., 2004
Moldão-Martins, M.; Beirão-da-Costa, S.; Neves, C.; Cavaleiro, C.; Salgueiro, L.; Beirão-da-Costa, M.L., Olive oil flavoured by the essential oils of Mentha × piperita and Thymus mastichina L., Food Qual. Pref., 2004, 15, 5, 447-452, https://doi.org/10.1016/j.foodqual.2003.08.001 . [all data]

Mumm, Tiemann, et al., 2004
Mumm, R.; Tiemann, T.; Schulz, S.; Hilker, M., Analysis of volatiles from black pine (Pinus nigra): significance of wounding and egg deposition by a herbivorous sawfly, Phytochemistry, 2004, 65, 24, 3221-3230, https://doi.org/10.1016/j.phytochem.2004.10.010 . [all data]

Ngassoum, Ousmaila, et al., 2004
Ngassoum, M.B.; Ousmaila, H.; Ngamo, L.T.; Maponmetsem, P.M.; Jirovetz, L.; Buchbauer, G., Aroma compounds of essential oils of two varieties of the spice plant Ocimum canum Sims from northern Cameroon, J. Food Comp. Anal., 2004, 17, 2, 197-204, https://doi.org/10.1016/j.jfca.2003.08.002 . [all data]

Özcan and Chalchat, 2004
Özcan, M.; Chalchat, J.-C., Aroma profile of Thymus vulgaris L. growing wild in Turkey, Bulg. J. Plant Physiol., 2004, 30, 3-4, 68-73. [all data]

Sartoratto, Machado, et al., 2004
Sartoratto, A.; Machado, A.L.M.; Delarmelina, C.; Figueira, G.M.; Duarte, M.C.T.; Rehder, V.L.G., Composition and antimicrobial activity of essential oils from aromatic plants used in Brazil, Braz. J. Microbiol., 2004, 35, 4, 275-280, https://doi.org/10.1590/S1517-83822004000300001 . [all data]

Tam, Thuam, et al., 2004
Tam, N.T.; Thuam, D.T.; Bighelli, A.; Castola, V.; Muselli, A.; Richomme, P.; Casanova, J., Baeckea frutescens leaf oil from Vietnam: composition and chemical variability, Flavour Fragr. J., 2004, 19, 3, 217-220, https://doi.org/10.1002/ffj.1281 . [all data]

Tzakou, Vagias, et al., 2004
Tzakou, O.; Vagias, C.; Gani, A.; Yannitsaros, A., Volatile constituents of essential oils isolated at different growth stages from three Conyza species growing in Greece, Flavour Fragr. J., 2004, 19, 425-428. [all data]

Vérité, Nacer, et al., 2004
Vérité, P.; Nacer, A.; Kabouche, Z.; Seguin, E., Composition of seeds and stems essential oils of Pituranthos scoparius (Coss. Dur.) Schinz, Flavour Fragr. J., 2004, 19, 6, 562-564, https://doi.org/10.1002/ffj.1353 . [all data]

Yoo, Kim, et al., 2004
Yoo, Z.-W.; Kim, N.-S.; Lee, D.-S., Comparative analyses of the flavors from Hallabong (Citrus sphaerocarpa) with lemon, orange, and grapefruit by SPTE and HS-SPME combined with GC-MS, Bull. Korean Chem. Soc., 2004, 25, 2, 271-279, https://doi.org/10.5012/bkcs.2004.25.2.271 . [all data]

Yu, Kim, et al., 2004
Yu, E.J.; Kim, T.H.; Kim, K.H.; Lee, H.J., Aroma-active compounds of Pinus densiflora (red pine) needles, Flavour Fragr. J., 2004, 19, 6, 532-537, https://doi.org/10.1002/ffj.1337 . [all data]

bin Ahmad and bin Jantan, 2003
bin Ahmad, F.; bin Jantan, I., Chemical constituents of the essential oils of Goniothalamus uvariodes King, Flavour Fragr. J., 2003, 18, 2, 128-130, https://doi.org/10.1002/ffj.1142 . [all data]

bin Ahmad and bin Jantan, 2003, 2
bin Ahmad, F.; bin Jantan, I., The essential oils of Boesenbergia stenophylla R. M. Sm. as natural sources of methyl (E)-cinnamate, Flavour Fragr. J., 2003, 18, 6, 485-486, https://doi.org/10.1002/ffj.1227 . [all data]

Bader, Caponi, et al., 2003
Bader, A.; Caponi, C.; Cioni, P.L.; Flamini, G.; Morelli, I., Composition of the essential oil of Ballota undulata, B. nigra ssp. foetida and B. saxatilis, Flavour Fragr. J., 2003, 18, 6, 502-504, https://doi.org/10.1002/ffj.1257 . [all data]

Bader, Caponi, et al., 2003, 2
Bader, A.; Caponi, C.; Cioni, P.L.; Flamini, G.; Morelli, I., Acorenone in the essential oil of flowering aerial parts of Seseli tortuosum L., Flavour Fragr. J., 2003, 18, 1, 57-58, https://doi.org/10.1002/ffj.1154 . [all data]

Cavaleiro, Salgueiro, et al., 2003
Cavaleiro, C.; Salgueiro, L.R.; da Cunha, A.P.; Figueiredo, A.C.; Barroso, J.G.; Bighelli, A.; Casanova, J., Composition and variability of the essential oils of the leaves and berries from Juniperus navicularis, Biochem. Syst. Ecol., 2003, 31, 2, 193-201, https://doi.org/10.1016/S0305-1978(02)00080-7 . [all data]

Cavalli, Tomi, et al., 2003
Cavalli, J.-F.; Tomi, F.; Bernardini, A.-F.; Casanova, J., Composition and chemical variability of the bark oil of Cedrelopsis grevei H. Baillon from Madagascar, Flavour Fragr. J., 2003, 18, 6, 532-538, https://doi.org/10.1002/ffj.1263 . [all data]

Choi, 2003
Choi, H.-S., Character impact odorants of Citrus Hallabong [(C. unshiu Marcov × C. sinensis Osbeck) × C. reticulata Blanco] cold-pressed peel oil, J. Agric. Food Chem., 2003, 51, 9, 2687-2692, https://doi.org/10.1021/jf021069o . [all data]

Ertugrul, Dural, et al., 2003
Ertugrul, K.; Dural, H.; Tugay, O.; Flamini, G.; Cioni, P.L.; Morelli, I., Essential oils from flowers of Centaurea kotschyi var. kotschyi and C. kotschyi var. decumbens from Turkey, Flavour Fragr. J., 2003, 18, 2, 95-97, https://doi.org/10.1002/ffj.1168 . [all data]

de Feo, Bruno, et al., 2003
de Feo, V.; Bruno, M.; Tahiri, B.; Napolitano, F.; Senatore, F., Chemical composition and antibacterial activity of essential oils from Thymus spinulosus Ten. (Lamiaceae), J. Agric. Food Chem., 2003, 51, 13, 3849-3853, https://doi.org/10.1021/jf021232f . [all data]

Flamini, Luigi Cioni, et al., 2003
Flamini, G.; Luigi Cioni, P.; Morelli, I., Short communication. Use of solid-phase micro-extraction as a sampling technique in the determination of volatiles emitted by flowers, isolated flower parts and pollen, J. Chromatogr. A, 2003, 998, 1-2, 229-233, https://doi.org/10.1016/S0021-9673(03)00641-1 . [all data]

Gancel, Ollitrault, et al., 2003
Gancel, A.-L.; Ollitrault, P.; Froelicher, Y.; Tomi, F.; Jacquemond, C.; Luro, F.; Brillouet, J.-M., Leaf volatile compounds of seven citrus somatic tetraploid hybrids sharing willow leaf mandarin (Citrus deliciosa Ten.) as their common parent, J. Agric. Food Chem., 2003, 51, 20, 6006-6013, https://doi.org/10.1021/jf0345090 . [all data]

Isidorov, Vinogorova, et al., 2003
Isidorov, V.A.; Vinogorova, V.T.; Rafalowski, K., HS-SPME analysis of volatile organic compounds of coniferous needle litter, Atmos. Environ., 2003, 37, 33, 4645-4650, https://doi.org/10.1016/j.atmosenv.2003.07.005 . [all data]

Jantan, Ling, et al., 2003
Jantan, I.; Ling, Y.E.; Romli, S.; Ayop, N.; Ahmad, A.S., A comparative study of the constituents of the essential oils of three Cinnamomum species from Malaysia, J. Essent. Oil Res., 2003, 15, 6, 387-391, https://doi.org/10.1080/10412905.2003.9698618 . [all data]

bin Jantan, Yassin, et al., 2003
bin Jantan, I.; Yassin, M.S.M.; Chin, C.B.; Chen, L.L.; Sim. N.L., Antifungal activity of the essential oils of nine Zingiberaceae species, Pharm. Biol., 2003, 41, 5, 392-397, https://doi.org/10.1076/phbi.41.5.392.15941 . [all data]

Ngassapa, Runyoro, et al., 2003
Ngassapa, O.; Runyoro, D.K.B.; Harvala, E.; Chinou, I.B., Composition and antimicrobial activity of essential oils of two populations of Tanzanian Lippia javanica (Burm. f.) Spreng. (Verbenaceae), Flavour Fragr. J., 2003, 18, 3, 221-224, https://doi.org/10.1002/ffj.1195 . [all data]

Skaltsa, Demetzos, et al., 2003
Skaltsa, H.D.; Demetzos, C.; Lazari, D.; Sokovic, M., Essential oil analysis and antimicrobial activity of eight Stachys species from Greece, Phytochemistry, 2003, 64, 3, 743-752, https://doi.org/10.1016/S0031-9422(03)00386-8 . [all data]

Tsiri, Kretsi, et al., 2003
Tsiri, D.; Kretsi, O.; Chinou, I.B.; Spyropoulos, C.G., Composition of fruit volatiles and annual changes in the volatiles of leaves of Eucalyptus camaldulensis Dehn. growing in Greece, Flavour Fragr. J., 2003, 18, 3, 244-247, https://doi.org/10.1002/ffj.1220 . [all data]

Choi, Kim. M.-S.L., et al., 2002
Choi, H.-S.; Kim. M.-S.L.; Sawamura, M., Constituents of the essential oil of cnidium officinale Makino, a Korean medicinal plant, Flavour Fragr. J., 2002, 17, 1, 49-53, https://doi.org/10.1002/ffj.1038 . [all data]

Couladis, Chinou, et al., 2002
Couladis, M.; Chinou, I.B.; Tzakou, O.; Loukis, A., Composition and antimicrobial activity of the essential oil of Ballota pseudodictamnus L. Bentham, Phytother. Res., 2002, 16, 8, 723-726, https://doi.org/10.1002/ptr.1043 . [all data]

Flamini, Cioni, et al., 2002
Flamini, G.; Cioni, P.L.; Morelli, I., Analysis of the essential oil of the aerial parts of Viola etrusca from Monte Labbro (South Tuscany, Italy) and in vivo analysis of flower volatiles using SPME, Flavour Fragr. J., 2002, 17, 2, 147-149, https://doi.org/10.1002/ffj.1060 . [all data]

Flamini, Cioni, et al., 2002, 2
Flamini, G.; Cioni, P.L.; Morelli, I., Differences in the fragrances of pollen and different floral parts of male and female flowers of Laurus nobilis, J. Agric. Food Chem., 2002, 50, 16, 4647-4652, https://doi.org/10.1021/jf020269x . [all data]

Fokialakis, Magiatis, et al., 2002
Fokialakis, N.; Magiatis, P.; Mitaku, S., Essential oil constituents of Valeriana italica and Valeriana tuberosa. Stereochemical and conformational study of 15-acetoxyvaleranone, Z. Naturforsch., 2002, 57c, 791-796. [all data]

Heinrich, Pfeifhofer, et al., 2002
Heinrich, G.; Pfeifhofer, H.W.; Stabentheiner, E.; Sawidis, T., Glandular hairs of Sigesbeckia jorullensis Kunth (Asteraceae): morphology, histochemistry and composition of essential oil, Ann. Bot. Rome, 2002, 89, 4, 459-469, retrieved from http://www.aob.oupjournals.org, https://doi.org/10.1093/aob/mcf062 . [all data]

bin Jantan and bin Ahmad, 2002
bin Jantan, I.; bin Ahmad, F., Chemical constituents of the essential oils of Goniothalamus malayanus Hook. f. and Thoms., Flavour Fragr. J., 2002, 17, 5, 372-374, https://doi.org/10.1002/ffj.1107 . [all data]

Javidnia, Miri, et al., 2002
Javidnia, K.; Miri, R.; Kamalinejad, M.; Nasiri, A., Composition of the essential oil of Salvia mirzayanii Rech. f. Esfand from Iran, Flavour Fragr. J., 2002, 17, 6, 465-467, https://doi.org/10.1002/ffj.1128 . [all data]

Kovacevic, Pavlovic, et al., 2002
Kovacevic, N.; Pavlovic, M.; Menkovic, N.; Tzakou, O.; Couladis, M., Composition of the essential oil from roots and rhizomes of Valeriana pancicii Halácsy Bald, Flavour Fragr. J., 2002, 17, 5, 355-357, https://doi.org/10.1002/ffj.1100 . [all data]

Lota, de Rocca Serra, et al., 2002
Lota, M.-L.; de Rocca Serra, D.; Tomi, F.; Jacquemond, C.; Casanova, J., Volatile components of peel and leaf oils of lemon and lime species, J. Agric. Food Chem., 2002, 50, 4, 796-805, https://doi.org/10.1021/jf010924l . [all data]

Mondello, Zappia, et al., 2002
Mondello, L.; Zappia, G.; Cotroneo, A.; Bonaccorsi, I.; Chowdhury, J.U.; Yusuf, M.; Dugo, G., Studies on the essential oil-bearing plants of Bangladesh. Part VIII. Composition of some Ocimum oils O. basilicum L. var. purpurascens; O. sanctum L. green; O. sanctum L. purple; O. americanum L., citral type; O. americanum L., camphor type, Flavour Fragr. J., 2002, 17, 5, 335-340, https://doi.org/10.1002/ffj.1108 . [all data]

Nath, Sarma, et al., 2002
Nath, S.C.; Sarma, K.K.; Vajezikova, I.; Leclercq, P.A., Comparison of volatile inflorescence oils and taxonomy of certain Cymbopogon taxa described as Cymbopogon flexuosus (Nees ex Steud.) Wats., Biochem. Syst. Ecol., 2002, 30, 2, 151-162, https://doi.org/10.1016/S0305-1978(01)00066-7 . [all data]

Pino, Marbot, et al., 2002
Pino, J.A.; Marbot, R.; Vázquez, C., Characterization of volatile in Cosa Rican Guava [Psidium friedrichsthalianum (Berg) Niedenzu] fruit, J. Agric. Food Chem., 2002, 50, 21, 6023-6026, https://doi.org/10.1021/jf011456i . [all data]

Pitarokili, Couladis, et al., 2002
Pitarokili, D.; Couladis, M.; Petsikos-Panayotarou, N.; Tzakou, O., Composition and antifungal activity on soil-borne pathogens of the essential oil of Salvia sclarea from Greece, J. Agric. Food Chem., 2002, 50, 23, 6688-6691, https://doi.org/10.1021/jf020422n . [all data]

Aligiannis, Kalpoutzakis, et al., 2001
Aligiannis, N.; Kalpoutzakis, E.; Chinou, I.B.; Mitaku, S.; Gikas, E.; Tsarbopoulos, A., Composition and antimicrobial activity of the essential oils of five taxa of Sideritis from Greece, J. Agric. Food Chem., 2001, 49, 2, 811-815, https://doi.org/10.1021/jf001018w . [all data]

Bortolomeazzi, Berno, et al., 2001
Bortolomeazzi, R.; Berno, P.; Pizzale, L.; Conte, L.S., Sesquiterpene, alkene, and alkane hydrocarbons in virgin olive oils of different varieties and geographical origins, J. Agric. Food Chem., 2001, 49, 7, 3278-3283, https://doi.org/10.1021/jf001271w . [all data]

Guilliard, Delgado, et al., 2001
Guilliard, M.; Delgado, W.; Martínez, J.R.; Stashenko, E., Determination of the enantiomeric purity of carvone, main component of Colombian Lippia alba (Mill) oil by means of bidimensional gas chromatography (23rd International Symposium on Capillary Chromatography), 2001, retrieved from http://www.richrom.com/assets/CD23PDF/i01.pdf. [all data]

Isidorov, Zenkevich, et al., 2001
Isidorov, V.A.; Zenkevich, I.G.; Krajewska, U.; Dubis, E.N.; Jaroszynska, J.; Bal, K., Gas chromatographic analysis of essential oils with preliminary partition of components, Phytochem. Anal., 2001, 12, 2, 87-90, https://doi.org/10.1002/pca.564 . [all data]

bin Jantan, Basni, et al., 2001
bin Jantan, I.; Basni, I.; Ahmad, A.S.; Ali, N.A.M.; Ahmad, A.R.; Ibrahim, H., Constituents of the rhizome oils of Boesenbergia pandurata (Roxb.) Schlecht from Malaysia, Indonesia and Thailand, Flavour Fragr. J., 2001, 16, 2, 110-112, https://doi.org/10.1002/ffj.956 . [all data]

Nogueira, Bittrich, et al., 2001
Nogueira, P.C.L.; Bittrich, V.; Shepherd, G.J.; Lopes, A.V.; Marsaioli, A.J., The ecological and taxonomic importance of flower volatiles of Clusia species (Guttiferae), Phytochemistry, 2001, 56, 5, 443-452, https://doi.org/10.1016/S0031-9422(00)00213-2 . [all data]

Rezzi, Cavaleiro, et al., 2001
Rezzi, S.; Cavaleiro, C.; Bighelli, A.; Salgueiro, L.; da Cunha, A.P.; Casanova, J., Intraspecific chemical variability of the leaf essential oil of Juniperus phoenicea subsp. turbinata from Corsica, Biochem. Syst. Ecol., 2001, 29, 2, 179-188, https://doi.org/10.1016/S0305-1978(00)00044-2 . [all data]

Skaltsa, Mavrommati, et al., 2001
Skaltsa, H.D.; Mavrommati, A.; Constantinidis, T., A chemotaxonomic investigation of volatile constituents in Stachys subsect. Swainsonianeae (Labiatae), Phytochemistry, 2001, 57, 2, 235-244, https://doi.org/10.1016/S0031-9422(01)00003-6 . [all data]

Zabaras and Wyllie, 2001
Zabaras, D.; Wyllie, S.G., Quantitative analysis of terpenoids in the gas phase using headspace solid-phase microextraction (HS-SPME), Flavour Fragr. J., 2001, 16, 6, 411-416, https://doi.org/10.1002/ffj.1025 . [all data]

Alonzo, Bosco, et al., 2000
Alonzo, G.; Bosco, S.F.D.; Palazzolo, E.; Saiano, F.; Tusa, N., Citrus somatic hybrid leaf essential oil, Flavour Fragr. J., 2000, 15, 4, 258-262, https://doi.org/10.1002/1099-1026(200007/08)15:4<258::AID-FFJ906>3.0.CO;2-F . [all data]

Bartley and Jacobs, 2000
Bartley, J.P.; Jacobs, A.L., Effects of drying on flavour compounds in Australian-grown ginger (Zingiber officinale), J. Sci. Food Agric., 2000, 80, 2, 209-215, https://doi.org/10.1002/(SICI)1097-0010(20000115)80:2<209::AID-JSFA516>3.0.CO;2-8 . [all data]

Bortolomeazzi, Pizzale, et al., 2000
Bortolomeazzi, R.; Pizzale, L.; Vichi, S.; Piasenzotto, L.; Conte, L.S., GC-MS Characterization of sesquiterpenic hydrocarbons in virgin olive oils, Proceedings 23rd ISCC; CD-ROM, 2000, retrieved from http://www.richrom.com/assets/CD23PDF. [all data]

Kim, Thuy, et al., 2000
Kim, T.H.; Thuy, N.T.; Shin, J.H.; Baek, H.H.; Lee, H.J., Aroma-active compounds of miniature beefsteakplant (Mosla dianthera Maxim.), J. Agric. Food Chem., 2000, 48, 7, 2877-2881, https://doi.org/10.1021/jf000219x . [all data]

Lazari, Skaltsa, et al., 2000
Lazari, D.M.; Skaltsa, H.D.; Constantinidis, T., Volatile constituents of Centaurea pelia DC., C. thessala Hausskn. subsp. drakiensis (Freyn Sint.) Georg. and C. zuccariniana DC. from Greece, Flavour Fragr. J., 2000, 15, 1, 7-11, https://doi.org/10.1002/(SICI)1099-1026(200001/02)15:1<7::AID-FFJ860>3.0.CO;2-3 . [all data]

Lota, de Rocca Serra, et al., 2000
Lota, M.-L.; de Rocca Serra, D.; Tomi, F.; Casanova, J., Chemical variability of peel and leaf essential oils of mandarins from Citrus reticulata Blanco, Biochem. Syst. Ecol., 2000, 28, 1, 61-78, https://doi.org/10.1016/S0305-1978(99)00036-8 . [all data]

Maia, de Paula, et al., 2000
Maia, B.H.L.N.S.; de Paula, J.R.; Sant'Ana, J.; da Silva, M.F.G.F.; Fernandes, J.B.; Vieira, P.C.; Costa, M.S.S.; Ohashi, O.S.; Silva, J.N.M., Essential oils of Toona and Cedrela species (Meliaceae): Taxonomic and ecological implications, J. Braz. Chem. Soc., 2000, 11, 6, 629-639, https://doi.org/10.1590/S0103-50532000000600012 . [all data]

Menut, Bessiere, et al., 2000
Menut, C.; Bessiere, J.M.; Ntalani, H.; Verin, P.; Henriques, A.T.; Limberger, R., Two chromene derivatives from Calyptranthes tricona, Phytochemistry, 2000, 53, 8, 975-979, https://doi.org/10.1016/S0031-9422(99)00601-9 . [all data]

Mondello, Zappia, et al., 2000
Mondello, L.; Zappia, G.; Dugo, P.; Dugo, G.; Bonaccorsi, I.; Dugo, G., Identification of complex samples by Fast-GC/MS using linear retention indices in conjunction with the MS-library, Proceedings, 23rd ISCC; CD-ROM, 2000, retrieved from http://www.richrom.com/assets/CD23PDF. [all data]

Pfeifhofer, 2000
Pfeifhofer, H.W., Composition of the essential oil of Pinus canariensis Sweet ex Sprengel, Flavour Fragr. J., 2000, 15, 4, 266-270, https://doi.org/10.1002/1099-1026(200007/08)15:4<266::AID-FFJ908>3.0.CO;2-E . [all data]

Skaltsa, Lazari, et al., 2000
Skaltsa, H.D.; Lazari, D.M.; Loukis, A.E.; Constantinidis, T., Essential oil analysis of Nepeta argolica Bory Chaub. subsp. argolica (Lamiaceae) growing wild in Greece, Flavour Fragr. J., 2000, 15, 2, 96-99, https://doi.org/10.1002/(SICI)1099-1026(200003/04)15:2<96::AID-FFJ873>3.0.CO;2-F . [all data]

Song, Sawamura, et al., 2000
Song, H.S.; Sawamura, M.; Ito, T.; Kawashimo, K.; Ukeda, H., Quantitative determination of characteric flavour of Citrus junos (yuzu) peel oil, Flavour Fragr. J., 2000, 15, 4, 245-250, https://doi.org/10.1002/1099-1026(200007/08)15:4<245::AID-FFJ904>3.0.CO;2-V . [all data]

Song, Sawamura, et al., 2000, 2
Song, H.S.; Sawamura, M.; Ito, T.; Ido, A.; Ukeda, H., Quantitative determination and characteristic flavour of daidai (Citrus aurantium L. var. cyathifera Y. Tanaka) peel oil, Flavour Fragr. J., 2000, 15, 5, 323-328, https://doi.org/10.1002/1099-1026(200009/10)15:5<323::AID-FFJ918>3.0.CO;2-J . [all data]

Verzera, Trozzi, et al., 2000
Verzera, A.; Trozzi, A.; Cotroneo, A.; Lorenzo, D.; Dellacassa, E., Uruguayan essential oil. 12. Composition of Nova and Satsuma mandarin oils, J. Agric. Food Chem., 2000, 48, 7, 2903-2909, https://doi.org/10.1021/jf990734z . [all data]

Zunino, Lopez, et al., 2000
Zunino, M.P.; Lopez, M.L.; Faillacik, S.M.; Lopez, A.G.; Espinar, L.A.; Zygadlo, J.A., Essential oil of Baccharis cordobensis Heering, Flavour Fragr. J., 2000, 15, 3, 151-152, https://doi.org/10.1002/1099-1026(200005/06)15:3<151::AID-FFJ884>3.0.CO;2-E . [all data]

Lazari, Skaltsa, et al., 1999
Lazari, D.M.; Skaltsa, H.D.; Constantinidis, T., Essential oils of Marrubium velutinum Sm. and Marrubium peregrinum L., growing wild in Greece, Flavour Fragr. J., 1999, 14, 5, 290-292, https://doi.org/10.1002/(SICI)1099-1026(199909/10)14:5<290::AID-FFJ828>3.0.CO;2-4 . [all data]

Mirza and Sefidkon, 1999
Mirza, M.; Sefidkon, F., Essential oil composition of two Salvia species from Iran, Salvia nemorosa L. and Salvia reuterana Boiss., Flavour Fragr. J., 1999, 14, 4, 230-232, https://doi.org/10.1002/(SICI)1099-1026(199907/08)14:4<230::AID-FFJ816>3.0.CO;2-L . [all data]

Muselli, Hoi, et al., 1999
Muselli, A.; Hoi, T.M.; Cu, L.D.; Moi, L.D.; Bessière, J.-M.; Bighelli, A.; Casanova, J., Composition of the essential oil of Acanthopanax trifoliatus (L.) Merr. (Araliacaea) from Vietnam, Flavour Fragr. J., 1999, 14, 1, 41-44, https://doi.org/10.1002/(SICI)1099-1026(199901/02)14:1<41::AID-FFJ781>3.0.CO;2-B . [all data]

Stashenko, Cervantes, et al., 1999
Stashenko, E.E.; Cervantes, M.; Combariza, Y.; Fuentes, H.; Martínez, J.R., HRGC/FID and HRGC/MSD analysis of the secondary metabolites obtained by different extraction methods from Lepechinia schiedeana, an in vitro evaluation of its antioxidant activity, J. Hi. Res. Chromatogr., 1999, 22, 6, 343-349, https://doi.org/10.1002/(SICI)1521-4168(19990601)22:6<343::AID-JHRC343>3.0.CO;2-J . [all data]

Sumathykutty, Rao, et al., 1999
Sumathykutty, M.A.; Rao, J.M.; Padmakumari, K.P.; Narayanan, C.S., Essential oil constituents of some Piper species, Flavour Fragr. J., 1999, 14, 5, 279-282, https://doi.org/10.1002/(SICI)1099-1026(199909/10)14:5<279::AID-FFJ821>3.0.CO;2-0 . [all data]

Bicchi, Rubiolo, et al., 1998
Bicchi, C.; Rubiolo, P.; Marschall, H.; Weyerstahl, P.; Laurent, R., Constituents of Artemisia roxburghiana Besser essential oil, Flavour Fragr. J., 1998, 13, 1, 40-46, https://doi.org/10.1002/(SICI)1099-1026(199801/02)13:1<40::AID-FFJ688>3.0.CO;2-Z . [all data]

Bicchi, Fresia, et al., 1997
Bicchi, C.; Fresia, M.; Rubiolo, P.; Monti, D.; Franz, C.; Goehler, I., Constituents of Tagetes lucida Cav. ssp. lucida essential oil, Flavour Fragr. J., 1997, 12, 1, 47-52, https://doi.org/10.1002/(SICI)1099-1026(199701)12:1<47::AID-FFJ610>3.0.CO;2-7 . [all data]

Sagrero-Nieves, Bartley, et al., 1997
Sagrero-Nieves, L.; Bartley, J.P.; Griselda Espinosa, B.; Dominguez, X.A.; Julia Verde S., Essential oil composition of Aristolochia brevipes Benth., Flavour Fragr. J., 1997, 12, 6, 401-403, https://doi.org/10.1002/(SICI)1099-1026(199711/12)12:6<401::AID-FFJ673>3.0.CO;2-D . [all data]

Tzakou, Roussis, et al., 1997
Tzakou, O.; Roussis, V.; Loukis, A.; Harvala, C.; Galati, E.M.; Germanò, M.P., Essential oil analysis of Teucrium divaricatum Heldr. ssp. divaricatum growing in Greece, Flavour Fragr. J., 1997, 12, 2, 113-115, https://doi.org/10.1002/(SICI)1099-1026(199703)12:2<113::AID-FFJ633>3.0.CO;2-3 . [all data]

Píry, Príbela, et al., 1995
Píry, J.; Príbela, A.; Durcanská, J.; Farkas, P., Fractionation of volatiles from blackcurrant (Ribes nigrum L.) by different extractive methods, Food Chem., 1995, 54, 1, 73-77, https://doi.org/10.1016/0308-8146(95)92665-7 . [all data]

Stashenko, Wiame, et al., 1995
Stashenko, E.; Wiame, H.; Dassy, S.; Martinez, J.R.; Shibamoto, T., Catalytic transformation of copaiba (Copaifera officinalis) oil over zeolite ZSM-5, J. Hi. Res. Chromatogr., 1995, 18, 1, 54-58, https://doi.org/10.1002/jhrc.1240180112 . [all data]

Bartley and Foley, 1994
Bartley, J.P.; Foley, P., Supercritical fluid extraction of Australian-grown ginger (Zingiber officinale), J. Sci. Food Agric., 1994, 66, 3, 365-371, https://doi.org/10.1002/jsfa.2740660314 . [all data]

Yang, Sugisawa, et al., 1992
Yang, R.; Sugisawa, H.; Nakatani, H.; Tamura, H.; Takagi, N., Comparison of odor quality in peel oils of acid citrus, Nippon Shokuhin Kogyo Gakkaishi, 1992, 39, 1, 16-24, https://doi.org/10.3136/nskkk1962.39.16 . [all data]

Le Quere and Latrasse, 1990
Le Quere, J.-L.; Latrasse, A., Composition of the Essential Oils of Blackcurrant Buds (Ribes nigrum L.), J. Agric. Food Chem., 1990, 38, 1, 3-10, https://doi.org/10.1021/jf00091a001 . [all data]

Montanarella, Bos, et al., 1986
Montanarella, L.; Bos, R.; Fischer, F.C., The Essential Oil in Lamina and Petiole of Heracleum dissectum Leaves, Planta Medica, 1986, 52, 04, 332-334, https://doi.org/10.1055/s-2007-969171 . [all data]