1,3,6,8-Tetraazatricyclo(4.4.1.1(3,8))dodecane

Gas phase ion energetics data

Data compiled by: Sharon G. Lias, Rhoda D. Levin, and Sherif A. Kafafi

Ionization energy determinations

IE (eV) Method Reference Comment
7.389PENelsen and Buschek, 1974Vertical value

References

Nelsen and Buschek, 1974
Nelsen, S.F.; Buschek, J.M., Charge delocalization in saturated systems. The radical cation of 1,3,6,8-tetraazatricyclo[4.4.1.13,8]dodecane, J. Am. Chem. Soc., 1974, 96, 6424. [all data]