2,3-Dichloro-2,5-cyclohexa-diene-1,4-dione

Condensed phase thermochemistry data

Data compiled by: Hussein Y. Afeefy, Joel F. Liebman, and Stephen E. Stein

Quantity Value Units Method Reference Comment
Δfsolid-61.7kcal/molCcbSjostrom, 1936At 318 K
Quantity Value Units Method Reference Comment
Δcsolid-584.6 ± 2.0kcal/molCcbSmith, Bjellerup, et al., 1953Reanalyzed by Cox and Pilcher, 1970, Original value = -585.1 ± 1.4 kcal/mol
Δcsolid-583.3kcal/molCcbSjostrom, 1936At 318 K

References

Sjostrom, 1936
Sjostrom, Av.G., De klorsubstituerade kinonernas och hydrokinonernas termokemi, Svensk. Kim. Tidr., 1936, 48, 121-124. [all data]

Smith, Bjellerup, et al., 1953
Smith, L.; Bjellerup, L.; Krook, S.; Westermark, H., Heats of combustion of organic chloro compounds determined by the "quartz wool" method, Acta Chem. Scand., 1953, 7, 65. [all data]

Cox and Pilcher, 1970
Cox, J.D.; Pilcher, G., Thermochemistry of Organic and Organometallic Compounds, Academic Press, New York, 1970, 1-636. [all data]