(dl) N-acetylalanine ethyl ester

Phase change data

Data compiled by: William E. Acree, Jr., James S. Chickos

Enthalpy of vaporization

ΔvapH (kJ/mol) Temperature (K) Method Reference Comment
65.2387.AStephenson and Malanowski, 1987Based on data from 372. - 460. K. See also Kkykj and Repas, 1973.

References

Stephenson and Malanowski, 1987
Stephenson, Richard M.; Malanowski, Stanislaw, Handbook of the Thermodynamics of Organic Compounds, 1987, https://doi.org/10.1007/978-94-009-3173-2 . [all data]

Kkykj and Repas, 1973
Kkykj, J.; Repas, M., Petrochemia, 1973, 13, 179. [all data]