2-Propenoic acid, 4-methylpentyl ester

Kovats' RI, non-polar column, isothermal

Data compiled by: NIST Mass Spectrometry Data Center, William E. Wallace, director

Column type CapillaryCapillaryCapillary
Active phase OV-101OV-101OV-101
Column length (m) 19.19.19.
Carrier gas N2N2N2
Substrate
Column diameter (mm) 0.280.280.28
Phase thickness (μm)
Temperature (C) 100.120.80.
I 1035.1036.1036.
ReferenceHorna, Táborský, et al., 1985Horna, Táborský, et al., 1985, 2Horna, Táborský, et al., 1985, 2
Comment MSDC-RI MSDC-RI MSDC-RI

References

Horna, Táborský, et al., 1985
Horna, A.; Táborský, J.; Churácek, J.; Dufka, O., Chromatography of monomers. IV. Gas-liquid chromatographic studies of C1-C6 n-alkyl and C3-C6 isoalkyl acrylates and their hydrogen halide and halogen addition derivatives, J. Chromatogr., 1985, 348, 141-149, https://doi.org/10.1016/S0021-9673(01)92447-1 . [all data]

Horna, Táborský, et al., 1985, 2
Horna, A.; Táborský, J.; Dufka, O.; Matousek, P.; Churácek, J., Chromatography of monomers. II. Glass capillary gas chromatography of C1-C18 alkyl esters of acrylic and methacrylic acids, J. Chromatogr., 1985, 325, 367-378, https://doi.org/10.1016/S0021-9673(00)96047-3 . [all data]