Pentyl phenylacetate

Kovats' RI, non-polar column, isothermal

Data compiled by: NIST Mass Spectrometry Data Center, William E. Wallace, director

Column type CapillaryCapillaryPacked
Active phase DB-1DB-5SE-30
Column length (m) 30.60.3.7
Carrier gas N2N2
Substrate   Chromosorb W AW DMCS
Column diameter (mm) 0.2560.321
Phase thickness (μm) 0.250.25
Temperature (C) 160.160.200.
I 1507.651529.291516.
ReferenceMijin and Antonovic, 2006Mijin and Antonovic, 2006Haken, Hartley, et al., 1983
Comment MSDC-RI MSDC-RI MSDC-RI

References

Mijin and Antonovic, 2006
Mijin, D.; Antonovic, D.G., The temperature dependence of the retention index for n-alkyl esters of acetic, propionic, cyclohexanecarboxylic, benzoic and phenylacetic acid on DB-1 and DB-5 capillary columns, J. Serb. Chem. Soc., 2006, 71, 6, 629-637, https://doi.org/10.2298/JSC0606629M . [all data]

Haken, Hartley, et al., 1983
Haken, J.K.; Hartley, H.N.T.; Srisukh, D., Retention increments of aromatic esters, Chromatographia, 1983, 17, 11, 589-596, https://doi.org/10.1007/BF02261941 . [all data]