Globulol

Normal alkane RI, non-polar column, temperature ramp

Data compiled by: NIST Mass Spectrometry Data Center, William E. Wallace, director

Column type CapillaryCapillaryCapillaryCapillaryCapillary
Active phase DB-5HP-5 MSHP-5 MSHP-5HP-5 MS
Column length (m) 30.30.30.30.30.
Carrier gas HeliumHelium HeliumHelium
Substrate
Column diameter (mm) 0.250.250.250.250.25
Phase thickness (μm) 0.250.250.250.250.25
Tstart (C) 60.50.60.60.50.
Tend (C) 240.180.300.240.180.
Heat rate (K/min) 3.2.15.3.2.
Initial hold (min)   2.
Final hold (min)   10.
I 1585.1590.1591.1585.1581.
ReferenceRodriques, Amorim, et al., 2013Phungpanya, Thongpoon, et al., 2012Xu, Han, et al., 2012Bertoli, Lepnardi, et al., 2011Hammami, Kamoun, et al., 2011
Comment MSDC-RI MSDC-RI MSDC-RI MSDC-RI MSDC-RI
Column type CapillaryCapillaryCapillaryCapillaryCapillary
Active phase HP-5DB-1HP-5DB-5DB-5
Column length (m) 30.25.30.30.30.
Carrier gas HeliumNitrogenHeliumHeliumHelium
Substrate
Column diameter (mm) 0.2520.250.250.250.25
Phase thickness (μm) 0.250.250.250.250.25
Tstart (C) 60.60.50.35.50.
Tend (C) 240.250.240.220.250.
Heat rate (K/min) 3.4.3.3.5.
Initial hold (min)  1.5. 2.
Final hold (min)  10. 40.
I 1588.1593.1603.1569.1585.
ReferenceCavar, Maksimovic, et al., 2010Mirjalili, Salehi, et al., 2010Monsef-Esfahani, Miri, et al., 2010El-Massry, El-Ghorab, et al., 2009Ho, Wang, et al., 2009
Comment MSDC-RI MSDC-RI MSDC-RI MSDC-RI MSDC-RI
Column type CapillaryCapillaryCapillaryCapillaryCapillary
Active phase DB-55 % Phenyl methyl siloxaneHP-5 MSHP-5DB-5
Column length (m) 30.60.30.30.30.
Carrier gas HeliumHeliumHeliumHeliumHelium
Substrate
Column diameter (mm) 0.250.250.250.250.25
Phase thickness (μm) 0.250.250.250.250.25
Tstart (C) 70.90.60.50.100.
Tend (C) 240.225.300.280.300.
Heat rate (K/min) 5.3.15.9.20.
Initial hold (min)   2.3.2.
Final hold (min)  3.10.3.10.
I 1623.1591.1591.1585.1585.
ReferenceLawal and Oyedelji, 2009Retta, Gattuso, et al., 2009Xu, Han, et al., 2009Aicha, Ines, et al., 2008Khokra, Prakash, et al., 2008
Comment MSDC-RI MSDC-RI MSDC-RI MSDC-RI MSDC-RI
Column type CapillaryCapillaryCapillaryCapillaryCapillary
Active phase VF-5MSHP-5DB-5 MSHP-5DB-5
Column length (m) 30.30.30.30.30.
Carrier gas HeliumHeliumHeliumHeliumHe
Substrate
Column diameter (mm) 0.250.320.250.250.26
Phase thickness (μm) 0.250.250.250.320.25
Tstart (C) 240.100.50.60.60.
Tend (C) 320.240.300.250.240.
Heat rate (K/min) 20.5.5.5.3.
Initial hold (min) 1.2.5.30.
Final hold (min)  5.5.
I 1595.1583.1580.1580.1583.
ReferenceKowalski, 2008Lago, Romoff, et al., 2008Noudogbessi, Yedomonhan, et al., 2008Yassa and Akhani, 2008Bos, Woerdenbag, et al., 2007
Comment MSDC-RI MSDC-RI MSDC-RI MSDC-RI MSDC-RI
Column type CapillaryCapillaryCapillaryCapillaryCapillary
Active phase DB-5DB-5DB-5ZB-5DB-5
Column length (m) 30.30.30.30.30.
Carrier gas HeliumHeHe Helium
Substrate
Column diameter (mm) 0.260.250.250.250.25
Phase thickness (μm) 0.250.250.250.250.25
Tstart (C) 60.35.60.60.60.
Tend (C) 290.220.300.220.300.
Heat rate (K/min) 3.3.3.4.3.
Initial hold (min)    5.
Final hold (min)  40. 20.
I 1583.1579.1579.1583.1557.
ReferenceElfami, Bos, et al., 2007El-Ghorab A., El-Massry K.F., et al., 2007Limberger, Scopel, et al., 2007Mohottalage, Tabacchi, et al., 2007Moreno, Lima, et al., 2007
Comment MSDC-RI MSDC-RI MSDC-RI MSDC-RI MSDC-RI
Column type CapillaryCapillaryCapillaryCapillaryCapillary
Active phase SPB-1DB-5DB-5HP-5 MSHP-5MS
Column length (m) 30.30.30.30.30.
Carrier gas HeHe HeliumHe
Substrate
Column diameter (mm) 0.20.250.250.250.25
Phase thickness (μm) 0.20.250.250.250.25
Tstart (C) 70.60.40.60.40.
Tend (C) 220.320.250.280.260.
Heat rate (K/min) 3.10.2.3.4.
Initial hold (min)
Final hold (min) 15.4.33.
I 1563.1599.1579.1584.1588.0
ReferencePinto, Salgueiro, et al., 2007Smelcerovic, Spiteller, et al., 2007Sylvestre, Pichette, et al., 2007Tsokou, Georgopoulos, et al., 2007Zizovic, Stamenic, et al., 2007
Comment MSDC-RI MSDC-RI MSDC-RI MSDC-RI MSDC-RI
Column type CapillaryCapillaryCapillaryCapillaryCapillary
Active phase DB-5DB-5AT-5DB-1DB-5
Column length (m) 30.30.60.60.30.
Carrier gas He HeNitrogenHelium
Substrate
Column diameter (mm) 0.250.250.250.250.26
Phase thickness (μm) 0.250.250.25 0.25
Tstart (C) 60.60.60.40.60.
Tend (C) 300.300.200.200.290.
Heat rate (K/min) 3.3.4.2.3.
Initial hold (min)    1.
Final hold (min)   20.9.
I 1575.1581.1580.1576.1583.
ReferenceApel, Sobral, et al., 2006Apel, Sobral, et al., 2006, 2Borges, Rojas, et al., 2006Chen, Sheu, et al., 2006Elfami, Komar, et al., 2006
Comment MSDC-RI MSDC-RI MSDC-RI MSDC-RI MSDC-RI
Column type CapillaryCapillaryCapillaryCapillaryCapillary
Active phase HP-5CP Sil 5 CBDB-5MS5 % Phenyl methyl siloxaneDB-5
Column length (m) 30.30.30.30.30.
Carrier gas HeN2HeHeliumHe
Substrate
Column diameter (mm) 0.250.320.250.250.25
Phase thickness (μm) 0.250.250.250.250.25
Tstart (C) 50.50.60.60.60.
Tend (C) 300.300.280.280.220.
Heat rate (K/min) 5.4.3.3.4.
Initial hold (min) 5.
Final hold (min) 5. 30.30.
I 1587.1588.1552.1552.1588.
ReferenceFiguérédo, Cabassu, et al., 2006Lis and Milczarek, 2006Maronigiu, Piras, et al., 2006Marongiu, Piras, et al., 2006Morteza-Semnani, Akbarzadeh, et al., 2006
Comment MSDC-RI MSDC-RI MSDC-RI MSDC-RI MSDC-RI
Column type CapillaryCapillaryCapillaryCapillaryCapillary
Active phase DB-5DB-5HP-5DB-5HP-5MS
Column length (m) 30.30.30.30.30.
Carrier gas HeHeHeHydrogen
Substrate
Column diameter (mm) 0.250.250.250.250.25
Phase thickness (μm) 0.250.250.250.250.25
Tstart (C) 60.50.60.70.50.
Tend (C) 220.250.220.280.250.
Heat rate (K/min) 4.4.5.4.10.
Initial hold (min) 5. 10.4.5.
Final hold (min)
I 1589.1592.1579.1582.1598.
ReferenceMorteza-Semnani K., Akbarzadeh M., et al., 2006Najafpour Navaei, Mirza, et al., 2006Pintore G., Chessa M., et al., 2006Pino, Marbot, et al., 2006Robinson, 2006
Comment MSDC-RI MSDC-RI MSDC-RI MSDC-RI MSDC-RI
Column type CapillaryCapillaryCapillaryCapillaryCapillary
Active phase DB-5DB-5DB-5HP-5SPB-1
Column length (m) 30.30.30.25.50.
Carrier gas HeHeN2H2He
Substrate
Column diameter (mm) 0.250.250.250.320.2
Phase thickness (μm) 0.250.250.250.520.33
Tstart (C) 60.60.60.50.50.
Tend (C) 200.260.240.280.220.
Heat rate (K/min) 2.5.4.2.54.
Initial hold (min)    5.1.
Final hold (min) 60.   10.
I 1582.1610.1584.1586.1568.
ReferenceRout, Naik, et al., 2006Sabulal, Dan, et al., 2006Trilles, Bombarda, et al., 2006Wang, Kong, et al., 2006Wong, Lim, et al., 2006
Comment MSDC-RI MSDC-RI MSDC-RI MSDC-RI MSDC-RI
Column type CapillaryCapillaryCapillaryCapillaryCapillary
Active phase SE-30DB-5DB-5DB-5HP-5
Column length (m) 30.30.30.30.30.
Carrier gas HeHeHeHeHe
Substrate
Column diameter (mm)  0.250.250.250.25
Phase thickness (μm)  0.250.250.250.25
Tstart (C) 90.60.60.60.60.
Tend (C) 220.240.240.300.30.
Heat rate (K/min) 7.3.3.3.4.
Initial hold (min) 2.  3.3.
Final hold (min)     15.
I 1583.1584.1587.1581.1584.
ReferenceAhuja, Bakshi, et al., 2005Chaverri and Cicció, 2005Chaverri and Cicció, 2005Ferraz, Limberger, et al., 2005Ferretti, Maggi, et al., 2005
Comment MSDC-RI MSDC-RI MSDC-RI MSDC-RI MSDC-RI
Column type CapillaryCapillaryCapillaryCapillaryCapillary
Active phase HP-5DB-1DB-5DB-5DB-5
Column length (m) 30.30.30.30.30.
Carrier gas HeHeHeHeliumHe
Substrate
Column diameter (mm) 0.250.250.320.250.25
Phase thickness (μm) 0.250.25 0.250.25
Tstart (C) 50.50.60.35.60.
Tend (C) 300.265.240.280.230.
Heat rate (K/min) 5.2.53.4.3.
Initial hold (min) 5.1. 2.
Final hold (min) 5.20.
I 1587.1570.1578.1611.1575.
ReferenceFiguérédo, Cabassu, et al., 2005Khanavi, Ghasemian, et al., 2005Khayyat and Karimi, 2005Kowalski, 2005Limberger, Sobral, et al., 2005
Comment MSDC-RI MSDC-RI MSDC-RI MSDC-RI MSDC-RI
Column type CapillaryCapillaryCapillaryCapillaryCapillary
Active phase CP Sil 5 CBDB-1HP-5MSDB-5DB-5
Column length (m) 25.50.30.30.30.
Carrier gas  N2 HeHe
Substrate
Column diameter (mm) 0.250.250.20.250.25
Phase thickness (μm) 0.150.25  0.25
Tstart (C) 50.95.60.40.40.
Tend (C) 230.240.280.240.260.
Heat rate (K/min) 3.4.3.4.2.
Initial hold (min)     5.
Final hold (min)     20.
I 1586.1583.1585.1582.1584.
ReferenceOgunwande, Olawore, et al., 2005Pala-Paul, Perez-Alonso, et al., 2005Petrakis, Roussis, et al., 2005Sefidkon and Jamzad, 2005Senatore, Apostolides Arnold, et al., 2005
Comment MSDC-RI MSDC-RI MSDC-RI MSDC-RI MSDC-RI
Column type CapillaryCapillaryCapillaryCapillaryCapillary
Active phase DB-5DB-5DB-5HP-5MSCP Sil 8 CB
Column length (m) 30.30.30.30.30.
Carrier gas HeHeHeHeHe
Substrate
Column diameter (mm) 0.250.250.250.250.25
Phase thickness (μm) 0.250.250.250.25
Tstart (C) 60.60.60.60.60.
Tend (C) 300.300.300.280.290.
Heat rate (K/min) 3.3.3.3.3.
Initial hold (min)     5.
Final hold (min)
I 1578.1579.1580.1591.1579.
ReferenceSimoes-Pires C.A., Debenedetti S., et al., 2005Simoes-Pires C.A., Debenedetti S., et al., 2005Simoes-Pires C.A., Debenedetti S., et al., 2005Slavkovska, Couladis, et al., 2005Suárez, Vásquez, et al., 2005
Comment MSDC-RI MSDC-RI MSDC-RI MSDC-RI MSDC-RI
Column type CapillaryCapillaryCapillaryCapillaryCapillary
Active phase CP Sil 5 CBDB-1DB-5DB-5DB-5
Column length (m) 30.30.25.60.30.
Carrier gas N2N2NitrogenHeHe
Substrate
Column diameter (mm) 0.250.250.250.250.25
Phase thickness (μm) 0.250.250.250.250.25
Tstart (C) 50.50.60.40.60.
Tend (C) 200.200.240.280.300.
Heat rate (K/min) 5.5.3.4.3.
Initial hold (min)    4.
Final hold (min)
I 1599.1582.1583.1583.1571.
ReferenceAgnaniet, Menut, et al., 2004Fekam Boyom, Fotio, et al., 2004JAvidnia, Mojab, et al., 2004Kalvandi, Sefidkon, et al., 2004Lago, de Ávila, et al., 2004
Comment MSDC-RI MSDC-RI MSDC-RI MSDC-RI MSDC-RI
Column type CapillaryCapillaryCapillaryCapillaryCapillary
Active phase DB-5MSDB-5RTX-1DB-5DB-5MS
Column length (m) 30.30.30.30.30.
Carrier gas HeHeN2 He
Substrate
Column diameter (mm) 0.250.250.320.250.25
Phase thickness (μm) 0.250.250.250.250.25
Tstart (C) 60.60.60.40.60.
Tend (C) 240.300.300.210.280.
Heat rate (K/min) 3.3.4.2.3.
Initial hold (min)    2.
Final hold (min)    33.30.
I 1584.1577.1590.1586.1557.
Referencepaz Lima, Silva, et al., 2004Limberger, Sobral, et al., 2004Lis, Boczek, et al., 2004Lopez Arze, Collin, et al., 2004Marongiu, Porcedda, et al., 2004
Comment MSDC-RI MSDC-RI MSDC-RI MSDC-RI MSDC-RI
Column type CapillaryCapillaryCapillaryCapillaryCapillary
Active phase DB-1DB-1HP-1DB-5DB-5
Column length (m) 60.30.30.30.30.
Carrier gas HeHeHeHe
Substrate
Column diameter (mm) 0.250.250.250.250.25
Phase thickness (μm) 0.250.250.330.250.25
Tstart (C) 50.50.40.40.60.
Tend (C) 270.265.260.250.300.
Heat rate (K/min) 4.2.52.2.3.
Initial hold (min)  1.5.5.
Final hold (min)  20.20.20.
I 1591.1572.1588.1586.1574.
ReferenceNik, Mirza, et al., 2004Sarkhail, Amin, et al., 2004Senatore, Napolitano, et al., 2004Senatore, Rigano, et al., 2004Suyenaga, Apel, et al., 2004
Comment MSDC-RI MSDC-RI MSDC-RI MSDC-RI MSDC-RI
Column type CapillaryCapillaryCapillaryCapillaryCapillary
Active phase HP-5DB-1Methyl SiliconeRSL-200RSL-200
Column length (m) 30.30.30.30.30.
Carrier gas HeN2HeH2H2
Substrate
Column diameter (mm) 0.320.250.320.320.32
Phase thickness (μm) 0.250.250.250.250.25
Tstart (C) 100.50.60.40.40.
Tend (C) 240.200.250.280.280.
Heat rate (K/min) 5.5.2.6.6.
Initial hold (min) 2. 2.5.5.
Final hold (min) 5. 5.5.5.
I 1592.1574.1568.1570.1588.
ReferenceChaves, Lago, et al., 2003Fekam Boyom, Ngouana, et al., 2003Jayaprakasha, Rao, et al., 2003Jirovetz, Buchbauer, et al., 2003Jirovetz, Buchbauer, et al., 2003, 2
Comment MSDC-RI MSDC-RI MSDC-RI MSDC-RI MSDC-RI
Column type CapillaryCapillaryCapillaryCapillaryCapillary
Active phase CP Sil 5 CBDB-5DB-5DB-5DB-5
Column length (m) 25.30.30.30.30.
Carrier gas HeHeHeHeHe
Substrate
Column diameter (mm) 0.250.250.250.250.25
Phase thickness (μm) 0.250.250.250.250.25
Tstart (C) 35.60.60.60.60.
Tend (C) 280.280.250.280.280.
Heat rate (K/min) 5.5.3.3.3.
Initial hold (min) 2.5
Final hold (min)    30.30.
I 1566.1575.1585.1569.1568.
ReferenceKanjilal, Kotoky, et al., 2003Lago, de Ávila, et al., 2003Limberger, Simões-Pires, et al., 2003Marongiu, Porcedda, et al., 2003Marongiu, Porcedda, et al., 2003
Comment MSDC-RI MSDC-RI MSDC-RI MSDC-RI MSDC-RI
Column type CapillaryCapillaryCapillaryCapillaryCapillary
Active phase DB-5DB-5DB-1DB-1DB-5
Column length (m) 30.30.60.60.30.
Carrier gas H2H2HeHeHe
Substrate
Column diameter (mm) 0.250.250.250.250.25
Phase thickness (μm) 0.250.250.250.250.25
Tstart (C) 60.60.50.40.60.
Tend (C) 280.280.250.260.240.
Heat rate (K/min) 4.4.4.4.3.
Initial hold (min) 10.10. 5.
Final hold (min) 40.40.
I 1583.1583.1590.1576.1585.
ReferencePino, Marbot, et al., 2003Pino, Marbot, et al., 2003Pourmortazavi, Sefidkon, et al., 2003Sefidkon, Naderi Nik, et al., 2003da Silva, Luz, et al., 2003
Comment MSDC-RI MSDC-RI MSDC-RI MSDC-RI MSDC-RI
Column type CapillaryCapillaryCapillaryCapillaryCapillary
Active phase DB-5HP-5PTE-5SE-30CP Sil 8 CB
Column length (m) 30.30.60.50.30.
Carrier gas N2N2H2HeHe
Substrate
Column diameter (mm) 0.250.250.320.250.25
Phase thickness (μm) 0.250.250.300.250.25
Tstart (C) 50.50.60.70.50.
Tend (C) 250.250.285.240.220.
Heat rate (K/min) 4.4.4.34.3.
Initial hold (min)  5.  2.
Final hold (min)
I 1583.1582.1583.1577.1579.
ReferenceFarah, Fechtal, et al., 2002Farah, Fechtal. M., et al., 2002Gudzic, Djokovic, et al., 2002Iñigo, Palá-Paúl, et al., 2002Juteau, Masotti, et al., 2002
Comment MSDC-RI MSDC-RI MSDC-RI MSDC-RI MSDC-RI
Column type CapillaryCapillaryCapillaryCapillaryCapillary
Active phase DB-5DB-5DB-5HP-5DB-5
Column length (m) 30.30.30.30.30.
Carrier gas  HeHe He
Substrate
Column diameter (mm) 0.250.250.250.320.25
Phase thickness (μm) 0.250.250.250.250.25
Tstart (C) 40.60.35.100.60.
Tend (C) 210.240.280.240.250.
Heat rate (K/min) 2.3.4.5.3.
Initial hold (min) 2. 2.2.
Final hold (min) 33. 15.5.
I 1581.1582.1596.1585.1572.
ReferenceKabouss, Charrouf, et al., 2002Kobaisy, Tellez, et al., 2002Krauze-Baranowska, Mardarowicz, et al., 2002Lago, Reis, et al., 2002Limberger, Simões-Pires, et al., 2002
Comment MSDC-RI MSDC-RI MSDC-RI MSDC-RI MSDC-RI
Column type CapillaryCapillaryCapillaryCapillaryCapillary
Active phase DB-5DB-5MSDB-5DB-1DB-1
Column length (m) 30.30.30.50.60.
Carrier gas HeHeHeN2He
Substrate
Column diameter (mm) 0.250.250.250.250.25
Phase thickness (μm) 0.250.250.250.25
Tstart (C) 60.60.60.80.40.
Tend (C) 240.240.220.225.250.
Heat rate (K/min) 3.3.4.4.4.
Initial hold (min)   5.
Final hold (min)
I 1585.1588.1585.1567.1587.
ReferenceMaia, da Silva, et al., 2002Maia, Zoghbi, et al., 2002Morteza-Semnani, Saeedi, et al., 2002Palá-Paúl, Pérez-Alonso, et al., 2002Sefidkon, Dabiri, et al., 2002
Comment MSDC-RI MSDC-RI MSDC-RI MSDC-RI MSDC-RI
Column type CapillaryCapillaryCapillaryCapillaryCapillary
Active phase DB-1DB-1DB-5MSDB-1DB-1
Column length (m) 60.60.30.60.60.
Carrier gas HeHeHeN2He
Substrate
Column diameter (mm) 0.250.250.250.2480.25
Phase thickness (μm) 0.250.250.250.250.25
Tstart (C) 40.40.60.60.40.
Tend (C) 280.280.270.220.280.
Heat rate (K/min) 4.4.3.3.4.
Initial hold (min) 5.5. 5.5.
Final hold (min)    22.
I 1572.1572.1585.1589.1593.
ReferenceSefidkon, Jalili, et al., 2002Sefidkon, 2002Zoghbi, Andrade, et al., 2002Bailac, Dellacasa, et al., 2001Dabiri and Sefidkon, 2001
Comment MSDC-RI MSDC-RI MSDC-RI MSDC-RI MSDC-RI
Column type CapillaryCapillaryCapillaryCapillaryCapillary
Active phase DB-1HP-5Optima-5RSL-200RTX-1
Column length (m) 60.30.30.30.30.
Carrier gas HeN2HeH2N2
Substrate
Column diameter (mm) 0.250.250.20.320.25
Phase thickness (μm) 0.250.25 0.250.25
Tstart (C) 40.60.50.40.60.
Tend (C) 280.220.250.280.300.
Heat rate (K/min) 4.5.3.6.4.
Initial hold (min) 5.10.3.5.
Final hold (min)    5.
I 1595.1584.1593.1571.1582.
ReferenceDabiri and Sefidkon, 2001Gallori, Flamini, et al., 2001Jacquemond-Collet, Bessière, et al., 2001Jirovetz L., Buchbauer G., et al., 2001Kalemba, Marschall, et al., 2001
Comment MSDC-RI MSDC-RI MSDC-RI MSDC-RI MSDC-RI
Column type CapillaryCapillaryCapillaryCapillaryCapillary
Active phase DB-5MSDB-5DB-1SPB-1DB-1
Column length (m) 30.60.30.30.25.
Carrier gas HeHeHeHeNitrogen
Substrate
Column diameter (mm) 0.250.250.20.320.50
Phase thickness (μm) 0.25  0.250.25
Tstart (C) 60.50.60.50.60.
Tend (C) 240.250.240.250.220.
Heat rate (K/min) 3.3.3.2.5.
Initial hold (min)  5.
Final hold (min) 30.
I 1568.1583.1588.51561.1584.
ReferenceMarongiu, Porcedda, et al., 2001Rousis, Papadogianni, et al., 2001Santos, Moreira, et al., 2001Vijayanand, Rao, et al., 2001Mallavarapu, Rao, et al., 2000
Comment MSDC-RI MSDC-RI MSDC-RI MSDC-RI MSDC-RI
Column type CapillaryCapillaryCapillaryCapillaryCapillary
Active phase HP-5DB-1OV-101CP Sil 5 CBDB-5
Column length (m) 30.60.50.25.30.
Carrier gas HeN2N2HeHe
Substrate
Column diameter (mm) 0.250.250.20.250.25
Phase thickness (μm) 0.250.25  0.25
Tstart (C) 40.75.80.50.40.
Tend (C) 240.220.200.230.250.
Heat rate (K/min) 3.4.1.3.2.
Initial hold (min) 5.1.  5.
Final hold (min)  8.20. 60.
I 1587.1594.1583.1566.1556.
ReferenceNovak, Novak, et al., 2000Bailac, Dellacasa, et al., 1999Menon, Chacko, et al., 1999Oyedeji, Olawore, et al., 1999Porta, Porcedda, et al., 1999
Comment MSDC-RI MSDC-RI MSDC-RI MSDC-RI MSDC-RI
Column type CapillaryCapillaryCapillaryCapillaryCapillary
Active phase DB-5OV-1CBP-1DB-5DB-5
Column length (m) 30.50.30.30.30.
Carrier gas HeHeHeHeHelium
Substrate
Column diameter (mm) 0.250.320.250.250.25
Phase thickness (μm) 0.250.25 0.250.25
Tstart (C) 60.50.60.60.60.
Tend (C) 240.250.240.240.240.
Heat rate (K/min) 3.10.4.3.3.
Initial hold (min)  5.
Final hold (min)  20.
I 1583.1584.1559.1595.1586.
ReferenceZoghbi, Andrade, et al., 1999Kökdil, Kurucu, et al., 1998Lamarque, Maestri, et al., 1998Maia, Zohhbi, et al., 1998Santos, Andrade, et al., 1998
Comment MSDC-RI MSDC-RI MSDC-RI MSDC-RI MSDC-RI
Column type CapillaryCapillaryCapillaryCapillaryCapillary
Active phase HP-1CBP-1OV-1DB-1BP-1
Column length (m) 60.25.50.60.50.
Carrier gas HeHeN2 H2
Substrate
Column diameter (mm) 0.250.220.270.320.30
Phase thickness (μm) 0.25 0.2
Tstart (C) 50.60.80.50.40.
Tend (C) 280.240.240.250.250.
Heat rate (K/min) 4.5.3.4.10.
Initial hold (min) 5.  0.11.
Final hold (min)    5.
I 1595.1585.1569.1570.1585.
ReferenceStashenko, Cervantes, et al., 1998Zygadlo, Ariza-Espinar, et al., 1997Ramanoelina, Viano, et al., 1994Binder and Flath, 1989Brophy, Davies, et al., 1989
Comment MSDC-RI MSDC-RI MSDC-RI MSDC-RI MSDC-RI

Van Den Dool and Kratz RI, non-polar column, temperature ramp

Data compiled by: NIST Mass Spectrometry Data Center, William E. Wallace, director

Column type CapillaryCapillaryCapillaryCapillaryCapillary
Active phase BP-1CP-Sil PONA GBBP-1DB-5Methyl Silicone
Column length (m) 50.100.50.30.30.
Carrier gas HeHeHe He
Substrate
Column diameter (mm) 0.220.250.220.220.25
Phase thickness (μm) 0.250.250.250.250.25
Tstart (C) 60.140.60.60.80.
Tend (C) 220.230.220.240.220.
Heat rate (K/min) 2.5.2.3.2.
Initial hold (min)  10. 2.
Final hold (min) 20.25.20. 15.
I 1578.1610.1582.1582.1578.
ReferenceBoti, Koukoua, et al., 2007Cunicao, Lopes, et al., 2007Lesueur, de Rocca Serra, et al., 2007Martins, Santos, et al., 2007Melo, Corrêa, et al., 2007
Comment MSDC-RI MSDC-RI MSDC-RI MSDC-RI MSDC-RI
Column type CapillaryCapillaryCapillaryCapillaryCapillary
Active phase RTX-1RTX-1HP-5DB-5HP-5MS
Column length (m) 60.60.30.25.30.
Carrier gas HeHeHeHeHe
Substrate
Column diameter (mm) 0.220.220.250.250.25
Phase thickness (μm) 0.250.250.250.250.25
Tstart (C) 60.60.50.60.60.
Tend (C) 230.230.250.200.280.
Heat rate (K/min) 2.2.4.2.4.
Initial hold (min)   4. 5.
Final hold (min) 35.35.10.60.
I 1576.1583.1586.1588.1585.
ReferencePaolini J., Costa J., et al., 2007Paolini, Muselli, et al., 2007Quijano, Salamanca, et al., 2007Rout, Rao, et al., 2007Saroglou, Marin, et al., 2007
Comment MSDC-RI MSDC-RI MSDC-RI MSDC-RI MSDC-RI
Column type CapillaryCapillaryCapillaryCapillaryCapillary
Active phase DB-5HP-5MSDB-5DB-5HP-5
Column length (m) 30.30.30.30.30.
Carrier gas HeHeHeN2N2
Substrate
Column diameter (mm) 0.220.250.250.250.25
Phase thickness (μm) 0.250.250.250.250.25
Tstart (C) 55.60.50.60.60.
Tend (C) 240.280.250.240.220.
Heat rate (K/min) 3.3.3.3.5.
Initial hold (min) 2.  3.10.
Final hold (min) 15. 10.3.
I 1583.1582.1582.1587.1586.
ReferenceSilva, Barbosa, et al., 2007Vagionas, Ngassapa, et al., 2007Yu, Liao, et al., 2007Dob, Dahmane, et al., 2006Flamini, Tebano, et al., 2006
Comment MSDC-RI MSDC-RI MSDC-RI MSDC-RI MSDC-RI
Column type CapillaryCapillaryCapillaryCapillaryCapillary
Active phase HP-5HP-5DB-5DB-5HP-5MS
Column length (m) 30.25.30.30.30.
Carrier gas HeHeHeHeHe
Substrate
Column diameter (mm) 0.250.250.250.250.25
Phase thickness (μm) 0.250.250.250.250.25
Tstart (C) 60.60.50.50.80.
Tend (C) 260.240.250.250.300.
Heat rate (K/min) 3.4.5.5.4.
Initial hold (min)   2.2.
Final hold (min)
I 1585.1583.1585.1585.1587.7
ReferenceJavidnia K., Miri R., et al., 2006Rezazadeh, Hamedani, et al., 2006Su, Ho, et al., 2006Su, Ho, et al., 2006, 2Zhao C.X., Li, et al., 2006
Comment MSDC-RI MSDC-RI MSDC-RI MSDC-RI MSDC-RI
Column type CapillaryCapillaryCapillaryCapillaryCapillary
Active phase CP Sil 5 CBDB-1DB-1RTX-1SE-54
Column length (m) 25.30.25.60.25.
Carrier gas HeHe HeH2
Substrate
Column diameter (mm) 0.250.250.250.220.25
Phase thickness (μm) 0.40.250.250.250.2
Tstart (C) 80.40.60.60.50.
Tend (C) 270.260.180.230.250.
Heat rate (K/min) 10.2.3.2.4.
Initial hold (min)  5.10.
Final hold (min)  20.10.35.
I 1589.1569.1586.1576.1582.
ReferenceZiegenbein, Hanssen, et al., 2006de Feo, Urrunaga Soria, et al., 2005bin Jantan, Yalvema, et al., 2005Paolini, Costa, et al., 2005Simionatto, Porto, et al., 2005
Comment MSDC-RI MSDC-RI MSDC-RI MSDC-RI MSDC-RI
Column type CapillaryCapillaryCapillaryCapillaryCapillary
Active phase DB-1BP-1SPB-1DB-5SPB-1
Column length (m) 30.50.30.30.30.
Carrier gas N2HeHeN2He
Substrate
Column diameter (mm) 0.250.220.20.250.2
Phase thickness (μm) 0.250.250.20.250.2
Tstart (C) 50.60.70.60.70.
Tend (C) 200.230.220.240.220.
Heat rate (K/min) 5.2.3.3.3.
Initial hold (min)
Final hold (min)  35.15. 15.
I 1578.1576.1561.1584.1562.
ReferenceTchoumbougnang, Zollo, et al., 2005Vellutini, Baldovini, et al., 2005Cavaleiro, Salgueiro, et al., 2004Flamini, Cioni, et al., 2004Moldão-Martins, Beirão-da-Costa, et al., 2004
Comment MSDC-RI MSDC-RI MSDC-RI MSDC-RI MSDC-RI
Column type CapillaryCapillaryCapillaryCapillaryCapillary
Active phase BP-1DB-1DB-5MSBPX-5HP-5
Column length (m) 30.30.30.30.30.
Carrier gas N2 HeN2N2
Substrate
Column diameter (mm) 0.320.250.250.250.25
Phase thickness (μm) 0.250.250.250.250.25
Tstart (C) 60.50.40.75.60.
Tend (C) 220.265.200.210.220.
Heat rate (K/min) 5.2.54.3.5.
Initial hold (min)   5.10.10.
Final hold (min) 13. 20.1.
I 1578.1607.1588.1582.1585.
ReferenceRaina, Kumar, et al., 2004Ramezani, Behravan, et al., 2004Yu, Kim, et al., 2004bin Ahmad and bin Jantan, 2003Dural, Bagci, et al., 2003
Comment MSDC-RI MSDC-RI MSDC-RI MSDC-RI MSDC-RI
Column type CapillaryCapillaryCapillaryCapillaryCapillary
Active phase HP-5DB-5HP-5BPX-5RTX-5
Column length (m) 30.30.30.30.30.
Carrier gas N2HeHeHeHe
Substrate
Column diameter (mm) 0.250.250.250.250.25
Phase thickness (μm) 0.250.250.250.250.25
Tstart (C) 60.75.60.60.45.
Tend (C) 220.230.280.240.250.
Heat rate (K/min) 5.3.3.3.3.
Initial hold (min) 10.10. 2.6.
Final hold (min)  20.
I 1584.1582.1583.1591.1593.
ReferenceErtugrul, Dural, et al., 2003Jantan, Ling, et al., 2003Ngassapa, Runyoro, et al., 2003Shellie, Marriott, et al., 2003Shellie, Marriott, et al., 2003, 2
Comment MSDC-RI MSDC-RI MSDC-RI MSDC-RI MSDC-RI
Column type CapillaryCapillaryCapillaryCapillaryCapillary
Active phase HP-5SPB-1HP-5MSHP-5DB-1
Column length (m) 30.30.30.30.25.
Carrier gas HeHe  N2
Substrate
Column diameter (mm) 0.250.200.250.250.25
Phase thickness (μm) 0.250.200.250.25
Tstart (C) 60.70.50.60.60.
Tend (C) 280.220.280.280.180.
Heat rate (K/min) 3.3.3.3.3.
Initial hold (min)   5.5.10.
Final hold (min)  15.  10.
I 1584.1561.1583.1580.1580.
ReferenceTzakou, Couladis, et al., 2003Cavaleiro, Salgueiro, et al., 2002Demetzos, Angelopoulou, et al., 2002Fokialakis, Magiatis, et al., 2002bin Jantan and bin Ahmad, 2002
Comment MSDC-RI MSDC-RI MSDC-RI MSDC-RI MSDC-RI
Column type CapillaryCapillaryCapillaryCapillaryCapillary
Active phase SE-30DB-5BP-1RTX-5CP Sil 5 CB
Column length (m) 25.30.50.30.25.
Carrier gas N2HeHeHeN2
Substrate
Column diameter (mm) 0.250.250.220.250.25
Phase thickness (μm) 0.250.250.250.250.25
Tstart (C) 60.60.60.45.60.
Tend (C) 180.260.220.300.280.
Heat rate (K/min) 3.4.2.3.4.
Initial hold (min) 10.  6.6.
Final hold (min) 10. 20.10.
I 1580.1583.1580.1577.1570.
Referencebin Jantan, Ayop, et al., 2002Javidnia, Miri, et al., 2002Lota, de Rocca Serra, et al., 2002Mondello, Zappia, et al., 2002Pino, Marbot, et al., 2002
Comment MSDC-RI MSDC-RI MSDC-RI MSDC-RI MSDC-RI
Column type CapillaryCapillaryCapillaryCapillaryCapillary
Active phase CP Sil 5 CBCP Sil 5 CBRTX-5RTX-5DB-5
Column length (m) 30.50.30.30.30.
Carrier gas H2HeHeHeH2
Substrate
Column diameter (mm) 0.250.320.250.250.25
Phase thickness (μm) 0.250.40.250.250.25
Tstart (C) 60.60.45.45.60.
Tend (C) 280.280.250.250.240.
Heat rate (K/min) 2.3.3.3.3.
Initial hold (min) 10.10.6.6.
Final hold (min) 40.60.
I 1570.1573.1583.1589.1586.
ReferencePino, Marbot, et al., 2002, 2Pino, Marbot, et al., 2002, 3Shellie, Mondello, et al., 2002Shellie, Mondello, et al., 2002Nogueira, Bittrich, et al., 2001
Comment MSDC-RI MSDC-RI MSDC-RI MSDC-RI MSDC-RI
Column type CapillaryCapillaryCapillaryCapillaryCapillary
Active phase HP-5MSDB-5DB-5OV-101HP-5
Column length (m) 30.30.30.25.30.
Carrier gas HeHeHeN2He
Substrate
Column diameter (mm) 0.250.250.250.250.25
Phase thickness (μm) 0.250.250.25 0.25
Tstart (C) 60.60.60.50.50.
Tend (C) 280.240.240.200.280.
Heat rate (K/min) 4.3.3.5.4.
Initial hold (min) 5.2.2. 5.
Final hold (min)
I 1585.1581.1581.1583.1583.
ReferenceSkaltsa, Mavrommati, et al., 2001Maia, de Paula, et al., 2000Maia, de Paula, et al., 2000Menut, Bessiere, et al., 2000Lazari, Skaltsa, et al., 1999
Comment MSDC-RI MSDC-RI MSDC-RI MSDC-RI MSDC-RI
Column type CapillaryCapillaryCapillaryCapillaryCapillary
Active phase OV-101DB-1HP-1OV-1BP-1
Column length (m) 25.60.60.25.50.
Carrier gas N2HeHeH2He
Substrate
Column diameter (mm) 0.250.250.250.250.22
Phase thickness (μm)  0.250.250.30.25
Tstart (C) 50.50.50.50.60.
Tend (C) 200.220.250.200.230.
Heat rate (K/min) 5.4.2.53.2.
Initial hold (min)   5.1.
Final hold (min)    20.35.
I 1580.1594.1595.1550.1570.
ReferenceMenut, Bessiere, et al., 1999Mirza and Sefidkon, 1999Stashenko, Cervantes, et al., 1999Bicchi, Fresia, et al., 1997Mariotti, Tomi, et al., 1997
Comment MSDC-RI MSDC-RI MSDC-RI MSDC-RI MSDC-RI

Normal alkane RI, non-polar column, custom temperature program

Data compiled by: NIST Mass Spectrometry Data Center, William E. Wallace, director

Column type CapillaryCapillaryCapillaryCapillaryCapillary
Active phase DB-5DB-15 % Phenyl polydimethyl siloxaneCBP-5HP-5 MS
Column length (m) 30.30. 30.30.
Carrier gas HeliumHydrogen HeliumHelium
Substrate
Column diameter (mm) 0.250.25 0.250.25
Phase thickness (μm) 0.250.25 0.250.25
Program not specified45 0C 3 0C/min -> 175 0C 15 0C/min -> 300 0C (10 min)not specified60 0C 3 0C/min -> 246 0C 10 0C/min -> 270 0C (5 min)60 0C (1 min) 10 0C/min -> 180 0C (1 min) 20 0C/min -> 280 0C (15 min)
I 1590.1566.1584.1586.1587.
ReferenceRodriques, Amorim, et al., 2013Albano, Lima, et al., 2012Chaverri, Diaz, et al., 2011Fortes, Naves, et al., 2011Liu, Chu, et al., 2010
Comment MSDC-RI MSDC-RI MSDC-RI MSDC-RI MSDC-RI
Column type CapillaryCapillaryCapillaryCapillaryCapillary
Active phase HP-5HP-5Optima-5MSRTX-5RTX-5
Column length (m) 25.25.30.30.30.
Carrier gas HeliumHeliumHeliumNitrogenNitrogen
Substrate
Column diameter (mm) 0.320.320.320.250.25
Phase thickness (μm) 0.170.170.250.250.25
Program 60 0C (5 min) 4 0C/min -> 220 0C 11 0C/min -> 280 0C (15 min)not specified40 0C (5 min) 5 0C/min -> 230 0C 30 0C/min -> 280 0C (5 min)60 0C 95 min) 110 0C 3 0C/min -> 200 0C 5 0C/min -> 220 0C 95 min)not specified
I 1578.1590.1578.1590.1581.
ReferenceCuster, 2009Custer, 2009HEuskin, Godin, et al., 2009Leela, Vipin, et al., 2009Leela, Vipin, et al., 2009
Comment MSDC-RI MSDC-RI MSDC-RI MSDC-RI MSDC-RI
Column type CapillaryCapillaryCapillaryCapillaryCapillary
Active phase RTX-5RTX-5HP-5HP-5 MSDB-1
Column length (m) 30.30.25.30.30.
Carrier gas NitrogenNitrogenHeliumHeliumHydrogen
Substrate
Column diameter (mm) 0.250.250.320.250.25
Phase thickness (μm) 0.250.250.170.250.25
Program not specifiednot specified60 0C (5 min) 4 0C/min -> 220 0C 11 0C/min -> 280 0C40 0C (5 min) 2 0C/min -> 270 0C -> 260 0C (20 min)45 0C 3 0C/min -> 175 0C 15 0C/min -> 300 0C (10 min)
I 1583.1588.1588.1585.1566.
ReferenceLeela, Vipin, et al., 2009Leela, Vipin, et al., 2009Maggi, Bilek, et al., 2009Mancini, Arnold, et al., 2009Mendes, Trindade, et al., 2009
Comment MSDC-RI MSDC-RI MSDC-RI MSDC-RI MSDC-RI
Column type CapillaryCapillaryCapillaryCapillaryCapillary
Active phase CP Sil 8 CBDB-5DB-5DB-5 MSRTX-5
Column length (m) 30.30.30.30.30.
Carrier gas  HeliumHelium Helium
Substrate
Column diameter (mm) 0.250.250.250.250.25
Phase thickness (μm) 0.25  0.250.25
Program 60C => 2.5C/min => 170C => 10C/min => 250C (5min)80 0C (2 min) 3 0C/min -> 180 0C 10 0C/min -> 300 0C (10 min)not specified80 0C (1.5 min) 4 pC/min -> 180 0C 10 0C/min -> 300 0C (10 min)60 0C (5 min) 5 0C/min -> 110 0C 3 0C/min -> 220 0C (5 min)
I 1583.1583.1583.1585.1591.
ReferenceKristiawan, Sobolik, et al., 2008Santos, Costa, et al., 2008Santos, Costa, et al., 2008Silva, Doria, et al., 2008Zachariah, Leela, et al., 2008
Comment MSDC-RI MSDC-RI MSDC-RI MSDC-RI MSDC-RI
Column type CapillaryCapillaryCapillaryCapillaryCapillary
Active phase RTX-5HP-5MSDB-1HP-5MSDB-1
Column length (m) 30.30.30.30.30.
Carrier gas HeliumHeHeHeH2
Substrate
Column diameter (mm) 0.250.250.250.250.25
Phase thickness (μm) 0.250.250.250.250.25
Program not specified40C(10min) => 3C/min => 200C => 2C/min => 220C45C => 3C/min => 175C => 15C/min => 300C (10min)40C(5min) => 2C/min => 250C(15min) => 10C/min => 270C45 0C 3 0C/min -> 175 0C 15 0C/min -> 300 0C (10 min)
I 1583.1583.1566.1587.1566.
ReferenceZachariah, Leela, et al., 2008Cole, Haber, et al., 2007Ferreira, Meireles de Sousa, et al., 2007Formisano, Mignola, et al., 2007Kamatou, Viljoen, et al., 2007
Comment MSDC-RI MSDC-RI MSDC-RI MSDC-RI MSDC-RI
Column type CapillaryCapillaryCapillaryCapillaryCapillary
Active phase HP-5 MSDB-5HP-5 MSHP-5 MSHP-5MS
Column length (m) 30.30.30. 30.
Carrier gas HeliumHydrogenHelium He
Substrate
Column diameter (mm) 0.250.250.25 0.25
Phase thickness (μm) 0.250.25
Program 40 0C (10 min) 3 0C/min -> 200 0C 2 0C/min -> 220 0C35 0C 4 0C/min -> 180 0C 17 0C/min -> 280 0C (10 min)40 0C (10 min) 3 oC/min -> 200 0C 2 0C/min -> 220 0Cnot specified40C(10min) => 3C/min => 200C => 2C/min => 220C
I 1583.1585.1584.1585.1583.
ReferenceMoriarity, Bansal, et al., 2007Santos, Santiago, et al., 2007Setzer, Stokes, et al., 2007Stokes, Cole, et al., 2007Takaku, Haber, et al., 2007
Comment MSDC-RI MSDC-RI MSDC-RI MSDC-RI MSDC-RI
Column type CapillaryCapillaryCapillaryCapillaryCapillary
Active phase DB-5HP-5MSSPB-5DB-5HP-5MS
Column length (m) 30.30.30.30.30.
Carrier gas HeHeHeliumHeHe
Substrate
Column diameter (mm) 0.250.250.250.250.25
Phase thickness (μm) 0.250.250.100.250.25
Program 35C => 4C/min => 180C => 10C/min => 250C40C(5min) => 2C/min => 250C(15min) => 10C/min => 270C40 0C (1 min) 10 0C/min -> 120 0C 0.5 0C/min -> 150 0C 20 0C/min -> 280 0C (5 min)35C => 4C/min => 180C => 10C/min => 250C40C(5min) => 2C/min => 250C (15min) => 10C/min => 270C
I 1583.1585.1583.1574.1588.
ReferenceAlbuquerque, Canuto, et al., 2006Formisano C., Senatore F., et al., 2006Navickiene, Morandim, et al., 2006Santos, Nunes, et al., 2006Senatore, Apostolides Arnold, et al., 2006
Comment MSDC-RI MSDC-RI MSDC-RI MSDC-RI MSDC-RI
Column type CapillaryCapillaryCapillaryCapillaryCapillary
Active phase SE-52DB-1DB-5CP Sil 8 CBHP-5
Column length (m) 30.30.30.50.30.
Carrier gas HeHeHeHe
Substrate
Column diameter (mm) 0.320.250.250.320.25
Phase thickness (μm) 0.150.250.25 0.25
Program 45C => 1C/min => 100C => 5C/min => 250C (10min)45C => 3C/min => 175C => 15C/min => 300C (10min)35C => 4C/min => 180C => 10C/min => 250C60C(2min) => 5C/min => 160C (1min) => 10C/min => 250C (2min)40C(5min) => 2C/min => 250C(15min) => 10C/min => 270C
I 1585.1566.1581.1585.1585.
ReferenceTognolini, Barocelli, et al., 2006Figueiredo, Sim-Sim, et al., 2005de Menezes, Lemos, et al., 2005Judpentienë and Mockutë, 2004Senatore, Apostolides Arnold, et al., 2004
Comment MSDC-RI MSDC-RI MSDC-RI MSDC-RI MSDC-RI
Column type CapillaryCapillaryCapillaryCapillaryCapillary
Active phase SE-30DB-5DB-5DB-5DB-1
Column length (m)   30. 30.
Carrier gas   He
Substrate
Column diameter (mm)   0.25 0.25
Phase thickness (μm)   0.1 0.25
Program not specifiednot specified35C => 4C/min => 180C => 20C/min => 280Cnot specified45 0C 3 K/min -> 175 0C 15 K/min -> 300 0C (10 min)
I 1573.1585.1583.1569.1566.
ReferenceVinogradov, 2004Morteza-Semnani and Vahedi, 2002Viana, Andrade-Neto, et al., 2002Ferreira, Costantin, et al., 2001Figueiredo, Miguel, et al., 2001
Comment MSDC-RI MSDC-RI MSDC-RI MSDC-RI MSDC-RI
Column type CapillaryCapillaryCapillaryCapillaryCapillary
Active phase DB-5OV-1CP Sil 5 CBPolydimethyl siloxanesDB-1
Column length (m)  50.25. 60.
Carrier gas  HeHe
Substrate
Column diameter (mm)  0.32  0.32
Phase thickness (μm)  0.250.39
Program not specified1)50C(1min) => 4C/min => 180C => 2C/min => 250C(10min) 2)50C(1min) => 6C/min => 200C => 12C/min => 250C(5min)not specifiednot specifiednot specified
I 1578.1586.1583.1573.1571.
ReferencePetrakis, Tsitsimpikou, et al., 2001Kökdil, 1998Weyerstahl, Marschall, et al., 1998Zenkevich, 1997Binder and Flath, 1989
Comment MSDC-RI MSDC-RI MSDC-RI MSDC-RI MSDC-RI

Van Den Dool and Kratz RI, polar column, custom temperature program

Data compiled by: NIST Mass Spectrometry Data Center, William E. Wallace, director

Column type CapillaryCapillary
Active phase RTX-WaxHP-Innowax
Column length (m) 60.30.
Carrier gas  He
Substrate
Column diameter (mm) 0.250.25
Phase thickness (μm) 0.250.25
Program not specified60C(8min) => 3C/min => 180C(5min) => 40C/min => 250C
I 2076.2070.
ReferenceCavalli, Ranarivelo, et al., 2001Bisio, Ciarallo, et al., 1998
Comment MSDC-RI MSDC-RI

References

Rodriques, Amorim, et al., 2013
Rodriques, K.A. da.F.; Amorim, L.V.; de Oliveira, J.M.G.; Dias, C.N.; Moraes, D.F.C.; Andrade, E.H. deA.; Maia, J.G.S.; Carneiro, S.M.P.; Carvalho, F.A. deA., Eugenia uniflora L. essential oil as a potential anti-Leishmania agent: effect on Leishmania amazonensis and possible mechanism of action, Evidence-Based Complementary and Alternative Medicine, 2013, 2013, 1-10, https://doi.org/10.1155/2013/279726 . [all data]

Phungpanya, Thongpoon, et al., 2012
Phungpanya, C.; Thongpoon, C.; Pripdeevech, P.; Machan, T., Analysis of aroma volatiles from fresh leaves of Plectranthus amboinicus using solid phase microextraction (SPME) technique, Pure and Applied Chemistry International Conference 2012 (PACCON 2012), 2012, 16701672. [all data]

Xu, Han, et al., 2012
Xu, L.-L.; Han, T.; Wu, J.-Z.; Zhang, Q.-Y.; Zhang, H.; Huang, B.-K.; Rahman, K., Comparative research of chemical constituents, antifungal and antitumor properties of ether extracts of Panax ginseng and its endophytic fungus, 2012, retrieved from http://www.thefreelibrary.com/Comparative .... [all data]

Bertoli, Lepnardi, et al., 2011
Bertoli, A.; Lepnardi, M.; Krzyzanowska, J.; Oleszek, W.; Pistelli, L., Mentha longifolia in vitro cultures as safe source of flavouring ingradients, Acta Biochem. Polonica, 2011, 58, 4, 581-587. [all data]

Hammami, Kamoun, et al., 2011
Hammami, I.; Kamoun, N.; Rebai, A., Biocontrol of Botrytis cinerea with essential oil and methanol extract of Viola odorata flowers, Archives of Appl. Sci. Res., 2011, 3, 5, 44-51. [all data]

Cavar, Maksimovic, et al., 2010
Cavar, S.; Maksimovic, M.; Solic, M.E., Comparison of essential oil composition of Stachys menthufolia Vis. from two natural habitas in Croatia, Biologica Nyssana, 2010, 1, 1-2, 99-103. [all data]

Mirjalili, Salehi, et al., 2010
Mirjalili, M.H.; Salehi, P.; Sonboli, A.; HAdian, J.; Ebrahimi, S.N.; Yousefzadi, M., The composition and antibacterial activity of the essential oil of Levisticum officinale Koch flowers and fruits at different developmental stages, J. Serb. Chem. Soc., 2010, 75, 12, 1661-1669, https://doi.org/10.2298/JSC100524126M . [all data]

Monsef-Esfahani, Miri, et al., 2010
Monsef-Esfahani, H.R.; Miri, A.; Amini, M.; Amanzadeh, Y.; Hadjiakhoondi, A.; Hajiaghaee, R.; Ajani, Y., Seasonal variations in the chemical composition, antioxidant activity and total phenolic content of Teucrium persicum Boiss. essential oils, Res. J. Biol. Sci., 2010, 5, 7, 492-498, https://doi.org/10.3923/rjbsci.2010.492.498 . [all data]

El-Massry, El-Ghorab, et al., 2009
El-Massry, K.F.; El-Ghorab, A.H.; Shaaban, H.A.; Shibamoto, T., Chemical compositions and antioxidant/antimicrobial activities of various samples prepared from Schinus terebinthifolius leaves cultivated in Egipt, J. Agric. Food Chem., 2009, 57, 12, 5265-5270, https://doi.org/10.1021/jf900638c . [all data]

Ho, Wang, et al., 2009
Ho, C.-L.; Wang, E.I.-C.; Su, Y.-C., Essential oil compositions and bioactivities of the various parts of Cinnamomum camphora Sieb. var. linallolifera Fujuta, Journal title only in Chinese, 2009, 31, 2, 77-96. [all data]

Lawal and Oyedelji, 2009
Lawal, O.A.; Oyedelji, A.O., Chemical composition of the essential oils of Cyperus rotundus L. from South Africa, Molecules, 2009, 14, 8, 2909-2917, https://doi.org/10.3390/molecules14082909 . [all data]

Retta, Gattuso, et al., 2009
Retta, D.; Gattuso, M.; Gattuso, S.; Lira, P. Di Leo; van Baren, C.; Ferraro, G.; Bandoni A., Essential oil composition of Achyrocline flaccida (Weinm.) DC. (Asteraceae) from different locations of Argentina, Biochem. Systematics Ecol., 2009, 36, 12, 877-881, https://doi.org/10.1016/j.bse.2008.11.001 . [all data]

Xu, Han, et al., 2009
Xu, L.-L.; Han, T.; Wu, J.-Z.; Zhang, Q.-Y.; Zhang, H.; Huang, B.-K.; Rahman, K., Comparative research of chemical constituents, antifungal and antitumor properties of ether extracts of Panax ginseng and its endophytic fungus, Phytomedicine: Int. J. Phytotherapy Phytopharmacology, 2009, 16, 6-7, 609-616, https://doi.org/10.1016/j.phymed.2009.03.014 . [all data]

Aicha, Ines, et al., 2008
Aicha, N.; Ines, S.; Mohamed, B.S.; Ines, B.; Soumaya, K.; Kamel, G.; Mohamed, N.; Imed, C.; Mohamed, H.; Leila, C.-G., Chemical composition, mutagenic and antimutagenic activities of essential oils from (Tunisian) Artemisia campestris and Artemisia herba-alba, J. Ess. Oil Res., 2008, 20, 5, 471-477. [all data]

Khokra, Prakash, et al., 2008
Khokra, S.L.; Prakash, O.; Jain, S.; Aneja, K.R.; Dhingra, Y., Essential oil composition and antibacterial studies of Vitex negundo Linn. extracts, Indian J. Pharm. Sci., 2008, 70, 4, 522-526, https://doi.org/10.4103/0250-474X.44610 . [all data]

Kowalski, 2008
Kowalski, R., Antimicrobial activity of essential oils and extracts of rosinweed (Silphoum trifoliatum and Silphium integrifolium) plants used by the American Indians, Flav. Fragr. J., 2008, 23, 6, 426-433, https://doi.org/10.1002/ffj.1901 . [all data]

Lago, Romoff, et al., 2008
Lago, J.H.G.; Romoff, P.; Favero, O.A.; Souza, F.O.; Soares, M.G.; Baraldi, P.T.; Correa, A.G., Chemical composition of male and female Baccharis trimera (Less.) DC. (Asteraceae) essential oils, Biochem. Systematics Ecol., 2008, 36, 9, 737-740, https://doi.org/10.1016/j.bse.2008.05.009 . [all data]

Noudogbessi, Yedomonhan, et al., 2008
Noudogbessi, J.-P.; Yedomonhan, P.; Sohounhloue, D.C.K.; Chalchat, J.-C.; Figueredo, G., Chemical composition of essential oil of syzygium guineense (Willd.) DC. var. guineense (Myrtaceae) from Benin, Rec. Nat. Prod., 2008, 33-38. [all data]

Yassa and Akhani, 2008
Yassa, N.; Akhani, H., The essential oils composition in two species of the genus Eriocycla Lindl. (Apiaceae) from Iran, 2008, retrieved from http://biology.ut.ac.ir/members/akhani/PdfReprintNumber/27.pdf. [all data]

Bos, Woerdenbag, et al., 2007
Bos, R.; Woerdenbag, H.J.; Kayser, O.; Quax, W.J.; Ruslan, K.; Elfami, Essential oil constituents of Piper cubeba L. fils. from Indonesia, J. Essent. Oil Res., 2007, 19, 1, 14-17, https://doi.org/10.1080/10412905.2007.9699217 . [all data]

Elfami, Bos, et al., 2007
Elfami; Bos, R.; Ruslan, K.; Woerdenbag, H.J.; Kayser, P.; Quax, W.J., Essential Oil Constituents of Piper cubeba from Indonesia, 2007, 53-60. [all data]

El-Ghorab A., El-Massry K.F., et al., 2007
El-Ghorab A.; El-Massry K.F.; Shibamoto T., Chemical composition of the volatile extract and antioxidant activities of the volatile and nonvolatile extracts of Egyptian corn silk (Zea mays L.), J. Agric. Food Chem., 2007, 55, 22, 9124-9127, https://doi.org/10.1021/jf071646e . [all data]

Limberger, Scopel, et al., 2007
Limberger, R.P.; Scopel, M.; Sobral, M.; Henriques, A.T., Comparative analysis of volatiles from Drimys brasiliensis Miers and D. angustifolia Miers (Winteraceae) from Southern Brazil, Biochem. Syst. Ecol., 2007, 35, 3, 130-137, https://doi.org/10.1016/j.bse.2006.09.007 . [all data]

Mohottalage, Tabacchi, et al., 2007
Mohottalage, S.; Tabacchi, R.; Guerin, P.M., Components from Sri Lankan Piper betle L. leaf oil and their analogues showing toxicity against the housefly, Musca domestica, Flavour Fragr. J., 2007, 22, 2, 130-138, https://doi.org/10.1002/ffj.1770 . [all data]

Moreno, Lima, et al., 2007
Moreno, P.R.H.; Lima, M.E.L.; Sobral, M.; Young, M.C.M.; Cordeiro, I.; Apel, M.A.A.; Limberger, R.P.; Henriques, A.T., Essential oil composition of fruit colour varieties of Eugenia brasiliensis Lam., Sci. Agr.; (Piracicaba Praz.), 2007, 64, 4, 428-432. [all data]

Pinto, Salgueiro, et al., 2007
Pinto, E.; Salgueiro, L.R.; Cavaleiro, C.; Palmeira, A.; Goncalves, M.J., In vitro susceptibility of some species of yeasts and filamentous fungi to essential oils of Salvia of?cinalis, Ind. Crops Prod., 2007, 26, 2, 135-141, https://doi.org/10.1016/j.indcrop.2007.02.004 . [all data]

Smelcerovic, Spiteller, et al., 2007
Smelcerovic, A.; Spiteller, M.; Ligon, A.P.; Smelcerovic, Z.; Raabe, N., Essential oil composition of Hypericum L. species from Southeastern Serbia and their chemotaxonomy, Biochem. Syst. Ecol., 2007, 35, 2, 99-113, https://doi.org/10.1016/j.bse.2006.09.012 . [all data]

Sylvestre, Pichette, et al., 2007
Sylvestre, M.; Pichette, A.; Longtin, A.; Martin, M.-A.C.; Bercion, S.R.; Legault, J., Chemical composition of leaf essential oil of Hedyosmum arborescens and evaluation of its anticancer activity, Natural Product Communications, 2007, 2, 12, 1269-1272. [all data]

Tsokou, Georgopoulos, et al., 2007
Tsokou, A.; Georgopoulos, K.; Melliou, E.; Magiatis, P.; Tsitsa, E., Composition and enantiomeric analusis of the essential oil of the fruits and the leaves of Pistacia vera from Greece, Molecules, 2007, 12, 6, 1233-1239, https://doi.org/10.3390/12061233 . [all data]

Zizovic, Stamenic, et al., 2007
Zizovic, I.; Stamenic, M.; Ivanovic, J.; Orlovic, A.; Ristic, M.; Djordjevic, S.; Petrovic, S.D.; Skala, D., Supercritical carbon dioxide extraction of sesquiterpenes from valerian root, J. Supercrit. Fluids, 2007, 43, 2, 249-258, https://doi.org/10.1016/j.supflu.2007.05.007 . [all data]

Apel, Sobral, et al., 2006
Apel, M.A.; Sobral, M.; Zuanazzi, J.A.S.; Henriques, A.T., Essential oil composition of four Plinia species (Myrtaceae), Flavour Fragr. J., 2006, 21, 3, 565-567, https://doi.org/10.1002/ffj.1638 . [all data]

Apel, Sobral, et al., 2006, 2
Apel, M.A.; Sobral, M.; Zuanazzi, J.A.S.; Henriques, A.T., Essential oil composition of Calycorectes australis and Calycorectes psidiiflorus (Myrtaceae), Flavour Fragr. J., 2006, 21, 4, 656-658, https://doi.org/10.1002/ffj.1640 . [all data]

Borges, Rojas, et al., 2006
Borges, R.; Rojas, L.B.; Cegarra, J.A.; Usubillaga, A., Study of the essential oils from the leaves and flowers of Lepechinia conferta (Benth) Epl., Flavour Fragr. J., 2006, 21, 1, 155-157, https://doi.org/10.1002/ffj.1550 . [all data]

Chen, Sheu, et al., 2006
Chen, H.-C.; Sheu, M.-J.; Wu, C.-M., Characterization of Volatiles in Guava (Psidium guajava L. cv. Chung-Shan-Yueh-Pa) Fruit from Taiwan, J. Food Drug. Anal., 2006, 14, 4, 398-402. [all data]

Elfami, Komar, et al., 2006
Elfami, R.B.; Komar, R.; Woerdenbag, H.J.; Kayser, P.; Quax, W.J., Essential oil constituents of Piper cubeba from Indonesia, 2006, retrieved from http://dissertations.ub.rug.nl/FILES/facultiew/science/2006/elfahmi/05c5.pdf. [all data]

Figuérédo, Cabassu, et al., 2006
Figuérédo, G.; Cabassu, P.; Chalchat, J.-C.; Pasquier, B., Studies of Mediterranean oregano populations. VIII. Chemical composition of essential oils of oreganos of various origins, Flavour Fragr. J., 2006, 21, 1, 134-139, https://doi.org/10.1002/ffj.1543 . [all data]

Lis and Milczarek, 2006
Lis, A.; Milczarek, J., Chemical composition of the essential oils from fruits, leaves and flowers of Phellodendron sachalinense (Fr. Schmidt) Sarg., Flavour Fragr. J., 2006, 21, 4, 683-686, https://doi.org/10.1002/ffj.1662 . [all data]

Maronigiu, Piras, et al., 2006
Maronigiu, B.; Piras, A.; Porcedda, S.; Tuveri, E., Extraction of Santalum album and Boswellia carterii Birdw. volatile oil by supercritical carbon dioxide: influence of some process parameters, Flavour Fragr. J., 2006, 21, 4, 718-724, https://doi.org/10.1002/ffj.1718 . [all data]

Marongiu, Piras, et al., 2006
Marongiu, B.; Piras, A.; Porcedda, S.; Tuveri, E.; Maxia, A., Isolation of Seseli bocconi Guss. volatile oil by supercritical carbon dioxide extraction, Natural Product Research, 2006, 20, 9, 820-826, https://doi.org/10.1080/14786410500364684 . [all data]

Morteza-Semnani, Akbarzadeh, et al., 2006
Morteza-Semnani, K.; Akbarzadeh, M.; Changizi, S., Essential oils composition of Stachys byzantina, S. inflata, S. lavandulifolia and S. laxa from Iran, Flavour Fragr. J., 2006, 21, 2, 300-303, https://doi.org/10.1002/ffj.1594 . [all data]

Morteza-Semnani K., Akbarzadeh M., et al., 2006
Morteza-Semnani K.; Akbarzadeh M.; Moshiri K., The essential oil composition of Eupatorium cannabinum L. from Iran, Flavour Fragr. J., 2006, 21, 3, 521-523, https://doi.org/10.1002/ffj.1687 . [all data]

Najafpour Navaei, Mirza, et al., 2006
Najafpour Navaei, M.; Mirza, M.; Dini, M., Chemical composition of the essential oils of Rubia tinctorum L. aerial parts from Iran, Flavour Fragr. J., 2006, 21, 3, 519-520, https://doi.org/10.1002/ffj.1667 . [all data]

Pintore G., Chessa M., et al., 2006
Pintore G.; Chessa M.; Manconi P.; Zanetti S.; Deriu A.; Tirillini B., Chemical composition and antimicrobial activities of essential oil of stachys glutinosa L. from Sardinia, Natural Product Communications, 2006, 1, 12, 1133-1136. [all data]

Pino, Marbot, et al., 2006
Pino, J.A.; Marbot, R.; Payo, A.; Chao, D.; Herrera, P., Aromatic Plants from Western Cuba VII. Composition of the Leaf Oil of Psidium wrightii KRug et Urb., Lantana involucrata L., Cinnamonum montanum (Sw.) Berchtold et J. Persl. and Caesalpinia violacea (Mill.) Standley, J. Essent. Oil. Res., 2006, 18, 2, 170-174, https://doi.org/10.1080/10412905.2006.9699058 . [all data]

Robinson, 2006
Robinson, C.J., A new essential oil - Agonis fragrans, A report for the Rural Industries Research and Development Corporation, RIRDC Publication No. 06/090, Rural Industries Research and Development Corporation, Barton, ACT, 2006, 12. [all data]

Rout, Naik, et al., 2006
Rout, P.K.; Naik, S.N.; Rao, Y.R., Composition of the concrete, absolute, headspace and essential oil of the flowers of Michelia champaca Linn., Flavour Fragr. J., 2006, 21, 6, 906-911, https://doi.org/10.1002/ffj.1742 . [all data]

Sabulal, Dan, et al., 2006
Sabulal, B.; Dan, M.; Anil, J.J.; Kurup, R.; Pradeep, N.S.; Valsamma, R.K.; George, V., Caryophyllene-rich rhizome oil of Zingiber nimmonii from South India: Chemical characterization and antimicrobial activity, Phytochemistry, 2006, 67, 22, 2469-2473, https://doi.org/10.1016/j.phytochem.2006.08.003 . [all data]

Trilles, Bombarda, et al., 2006
Trilles, B.L.; Bombarda, I.; Bouraïma-Madjebi, S.; Raharivelomanana, P.; Bianchini, J.-P.; Gaydou, E.M., Occurrence of various chemotypes in niaouli [Melaleuca quinquenervia (Cav.) S. T. Blake] essential oil from New Caledonia, Flavour Fragr. J., 2006, 21, 4, 677-682, https://doi.org/10.1002/ffj.1649 . [all data]

Wang, Kong, et al., 2006
Wang, P.; Kong, C.H.; Zhang, C.X., Chemical Composition and Antimicrobial Activity of the Essential Oil from Ambrosia trifida L., Molecules, 2006, 11, 7, 549-555, https://doi.org/10.3390/11070549 . [all data]

Wong, Lim, et al., 2006
Wong, K.C.; Lim, T.B.; Ali, D.M.H., Essential oil of Homalomena sagittifolia Jungh., Flavour Fragr. J., 2006, 21, 5, 786-788, https://doi.org/10.1002/ffj.1714 . [all data]

Ahuja, Bakshi, et al., 2005
Ahuja, A.; Bakshi, S.K.; Sharma, S.K.; Thappa, R.K.; Agarwal, S.G.; Kichlu, S.K.; Paul, R.; Kaul, M.K., Production of volatile terpenes by proliferating shoots and micropropagated plants of Santolina chamaecyparissus L. (cotton lavender), Flavour Fragr. J., 2005, 20, 4, 403-406, https://doi.org/10.1002/ffj.1440 . [all data]

Chaverri and Cicció, 2005
Chaverri, C.; Cicció, J.F., Essential oil of trees of the genus Ocotea (Lauraceae) in Costa Rica. I. Ocotea brenesii, Rev. Biol. Trop., 2005, 53, 3-4, 431-436, https://doi.org/10.15517/rbt.v53i3-4.14611 . [all data]

Ferraz, Limberger, et al., 2005
Ferraz, A.B.F.; Limberger, R.P.; Bordignon, S.A.L.; von Poser, G.L.; Henriques, A.T., Essential oil composition of six Hypericum species from southern Brazil, Flavour Fragr. J., 2005, 20, 3, 335-339, https://doi.org/10.1002/ffj.1435 . [all data]

Ferretti, Maggi, et al., 2005
Ferretti, G.; Maggi, F.; Tirillini, B., Essential oil composition of Hypericum richeri Vill. from Italy, Flavour Fragr. J., 2005, 20, 3, 295-298, https://doi.org/10.1002/ffj.1412 . [all data]

Figuérédo, Cabassu, et al., 2005
Figuérédo, G.; Cabassu, P.; Chalchat, J.-C.; Pasquier, B., Studies of Mediterranean oregano populations- V. Chemical composition of essential oils of oregano: Origanum syriacum L. var. bevanii (Holmes) Ietswaart, O. syriacum L. var. sinaicum (Boiss.) Ietswaart, and O. syriacum L. var. syriacum from Lebanon and Israel, Flavour Fragr. J., 2005, 20, 164-168. [all data]

Khanavi, Ghasemian, et al., 2005
Khanavi, M.; Ghasemian, L.; Motlagh, E.H.; Hadjiakhoondi, A.; Shafiee, A., Chemical composition of the essential oils of Marrubium parviflorum Fisch. C.A. Mey. and Marrubium vulgare L. from Iran, Flavour Fragr. J., 2005, 20, 3, 324-326, https://doi.org/10.1002/ffj.1425 . [all data]

Khayyat and Karimi, 2005
Khayyat, M.H.; Karimi, H., Composition of the volatile oils of three different species of Artemisia, Iranian Journal of Pharmaceutical Sciences, 2005, 1, 1, 29-32. [all data]

Kowalski, 2005
Kowalski, R., Analysis of lipophylic fraction from leaves, inflorescences and rhizomes of Siphium perfoliatum L., Acta Soc. Botanicorum Poloniae, 2005, 74, 1, 5-10, https://doi.org/10.5586/asbp.2005.001 . [all data]

Limberger, Sobral, et al., 2005
Limberger, R.P.; Sobral, M.; Henriques, A.T., Intraspecific volatile oil variation in Myrceugenia cucullata (Myrtaceae), Biochem. Syst. Ecol., 2005, 33, 3, 287-293, https://doi.org/10.1016/j.bse.2004.10.002 . [all data]

Ogunwande, Olawore, et al., 2005
Ogunwande, I.A.; Olawore, N.O.; Adeleke, K.A.; Ekundayo, O., Volatile constituents from the leaves of Eucalyptus cloeziana F. Muell and E. propinqua Deane Maiden from Nigeria, Flavour Fragr. J., 2005, 20, 6, 637-639, https://doi.org/10.1002/ffj.1516 . [all data]

Pala-Paul, Perez-Alonso, et al., 2005
Pala-Paul, J.; Perez-Alonso, M.J.; Velasco-Negueruela, A.; Vadare, J.; Villa, A.M.; Sanz, J.; Brophy, J.J., Essential oil composition of the different parts of Eryngium bourgatii Gouan from Spain, J. Chromatogr. A, 2005, 1074, 1-2, 235-239, https://doi.org/10.1016/j.chroma.2005.03.036 . [all data]

Petrakis, Roussis, et al., 2005
Petrakis, P.V.; Roussis, V.; Papadimitriou, D.; Vagias, C.; Tsitsimpikou, C., The effect of terpenoid extracts from 15 pine species on the feeding behavioural sequence of the late instars of the pine processionary caterpillar Thaumetopoea pityocampa, Behav. Processes, 2005, 69, 3, 303-322, https://doi.org/10.1016/j.beproc.2004.12.008 . [all data]

Sefidkon and Jamzad, 2005
Sefidkon, F.; Jamzad, Z., Chemical composition of the essential oil of three Iranian Satureja species (S. mutica, S. macrantha and S. intermedia), Food Chem., 2005, 91, 1, 1-4, https://doi.org/10.1016/j.foodchem.2004.01.027 . [all data]

Senatore, Apostolides Arnold, et al., 2005
Senatore, F.; Apostolides Arnold, N.; Bruno, M., Volatile components of Centaurea eryngioides Lam. and Centaurea liberica Trev. var. hermonis Boiss. Lam., two Asteraceae growing wild in Lebanon, Nat. Prod. Res., 2005, 19, 8, 749-754, https://doi.org/10.1080/14786410412331302136 . [all data]

Simoes-Pires C.A., Debenedetti S., et al., 2005
Simoes-Pires C.A.; Debenedetti S.; Spegazzini E.; Mentz L.A.; Matzenbacher N.I.; Limberger R.P.; Henriques A.T., Investigation of the essential oil from eight species of Baccharis belonging to sect. Caulopterae (Asteraceae, Astereae): a taxonomic approach, Plant Systematics and Evolution, 2005, 253, 1-4, 23-32, https://doi.org/10.1007/s00606-005-0296-6 . [all data]

Slavkovska, Couladis, et al., 2005
Slavkovska, V.; Couladis, M.; Bojovic, S.; Tzakou, O.; Pavlovic, M.; Lakusic, B.; Jancic, R., Essential oil and its systematic significance in species of Micromeria Bentham from Serbia Montenegro, Plant Systematics and Evolution, 2005, 255, 1-2, 1-15, https://doi.org/10.1007/s00606-005-0303-y . [all data]

Suárez, Vásquez, et al., 2005
Suárez, A.I.; Vásquez, L.J.; Manzano, M.A.; Compagnone, R.S., Essential oil composition of Croton cuneatus and Croton malambo growing in Venezuela, Flavour Fragr. J., 2005, 20, 6, 611-614, https://doi.org/10.1002/ffj.1498 . [all data]

Agnaniet, Menut, et al., 2004
Agnaniet, H.; Menut, C.; Bessière, J.-M., Aromatic plants of tropical central Africa. Part XLIX: chemical composition of essential oils of the leaf and rhizome of Aframomum giganteum K. Schum from Gabon, Flavour Fragr. J., 2004, 19, 3, 205-209, https://doi.org/10.1002/ffj.1403 . [all data]

Fekam Boyom, Fotio, et al., 2004
Fekam Boyom, F.; Fotio, D.; Amvam Zollo, P.H.; Agnaniet, H.; Menut, C.; Bessière, J.M., Aromatic plants of tropical Central Africa. Part XLIV. Volatile components from Pseudocedrela kotschyi (Schweinf.) harms growing in Cameroon, Flavour Fragr. J., 2004, 19, 1, 9-11, https://doi.org/10.1002/ffj.1254 . [all data]

JAvidnia, Mojab, et al., 2004
JAvidnia, K.; Mojab, F.; Mojahedi, S.A., Chemical constituents of the essential oil of Stachys lavandulifolia Vahl from Iran, Iranian J. Pharm. Res., 2004, 3, 61-63. [all data]

Kalvandi, Sefidkon, et al., 2004
Kalvandi, R.; Sefidkon, F.; Atri, M.; Mirza, M., Analysis of the essential oil of Thymus eriocalyx from Iran, Flavour Fragr. J., 2004, 19, 4, 341-343, https://doi.org/10.1002/ffj.1312 . [all data]

Lago, de Ávila, et al., 2004
Lago, J.H.G.; de Ávila, P., Jr.; de Aquino, E.M.; Moreno, P.R.H.; Ohara, M.T.; Limberger, R.P.; Apel, M.A.; Henriques, A.T., Volatile oils from leaves and stem barks of Cedrela fissilis (Meliaceae): chemical composition and antibacterial activities, Flavour Fragr. J., 2004, 19, 5, 448-451, https://doi.org/10.1002/ffj.1347 . [all data]

paz Lima, Silva, et al., 2004
paz Lima, M.; Silva, T.M.D.; da Silva, J.D.; Zoghbi, M.G.B.; Andrade, E.H.A., Essential oil composition of leaf and fine stem of Aniba canelilla (Kunth) Mez from Manaus, Brazil., Acta Amazonica, 2004, 34, 2, 329-330, https://doi.org/10.1590/S0044-59672004000200019 . [all data]

Limberger, Sobral, et al., 2004
Limberger, R.P.; Sobral, M.; Henriques, A.T.; Menut, C.; Bessière, J.-M., Óleos voláteis de espécies de Myrcia nativas do rio grande do sul, Quim. Nova, 2004, 27, 6, 916-919, https://doi.org/10.1590/S0100-40422004000600015 . [all data]

Lis, Boczek, et al., 2004
Lis, A.; Boczek, E.; Góra, J., Chemical composition of the essential oils from fruits, leaves and flowers of the Amur cork tree (Phellodendron amurense Rupr.), Flavour Fragr. J., 2004, 19, 6, 549-553, https://doi.org/10.1002/ffj.1349 . [all data]

Lopez Arze, Collin, et al., 2004
Lopez Arze, J.B.; Collin, G.; Garneau, F.-X.; Jean, F.-I.; Gagnon, H., Essential oils from Bolivia. II. Asteraceae: Ophryosporus heptanthus (Wedd.) H. Rob. et King, J. Essent. Oil Res., 2004, 16, 4, 374-376, https://doi.org/10.1080/10412905.2004.9698747 . [all data]

Marongiu, Porcedda, et al., 2004
Marongiu, B.; Porcedda, A.P.S.; Casu, R.; Pierucci, P., Chemical composition of the oil and supercritical CO2 extract of Schinus molle L., Flavour Fragr. J., 2004, 19, 6, 554-558, https://doi.org/10.1002/ffj.1350 . [all data]

Nik, Mirza, et al., 2004
Nik, Z.B.; Mirza, M.; Shahmir, F., Essential oil of Marrubium cuneatum Russell and its secretory elements, Flavour Fragr. J., 2004, 19, 3, 233-235, https://doi.org/10.1002/ffj.1293 . [all data]

Sarkhail, Amin, et al., 2004
Sarkhail, P.; Amin, G.; Shafiee, A., Composition of the essential oil of Phlomis persica Boiss and Phlomis chorassanica Bunge from Iran, Flavour Fragr. J., 2004, 19, 6, 538-540, https://doi.org/10.1002/ffj.1338 . [all data]

Senatore, Napolitano, et al., 2004
Senatore, F.; Napolitano, F.; Mohamed, M.A.-H.; Harris, P.J.C.; MnKeni, P.N.S.; Henderson, J., Antibacterial activity of Tagetes minuta L. (Asteraceae) essential oil with different chemical composition, Flavour Fragr. J., 2004, 19, 6, 574-578, https://doi.org/10.1002/ffj.1358 . [all data]

Senatore, Rigano, et al., 2004
Senatore, F.; Rigano, D.; de Fusco, R.; Bruno, M., Composition of the essential oil from flowerheads of Chrysanthemum coronarium L. (Asteraceae) growing wild in Southern Italy, Flavour Fragr. J., 2004, 19, 2, 149-152, https://doi.org/10.1002/ffj.1285 . [all data]

Suyenaga, Apel, et al., 2004
Suyenaga, E.S.; Apel, M.A.; Chaves, C.G.; Zuanazzi, J.A.; Henriques, A.T., Essential oil composition of Heterothalamus psiadioides Less, Biochem. Syst. Ecol., 2004, 32, 1, 83-86, https://doi.org/10.1016/S0305-1978(03)00190-X . [all data]

Chaves, Lago, et al., 2003
Chaves, M.H.; Lago, J.H.G.; Roque, N.F., Macrocarpane, a new sesquiterpene skeleton from the leaves of Porcelia macrocarpa, J. Braz. Chem. Soc., 2003, 14, 1, 16-19, retrieved from http://jbcs.sbq.org.br/jbcs/2003/v14n1/03.pdf, https://doi.org/10.1590/S0103-50532003000100004 . [all data]

Fekam Boyom, Ngouana, et al., 2003
Fekam Boyom, F.; Ngouana, V.; Amvam Zollo, P.H.; Menut, C.; Bessiere, J.M.; Gut, J.; Rosenthal, P.J., Composition and anti-plasmodial activities of essential oils from some Cameroonian medicinal plants, Phytochemistry, 2003, 64, 7, 1269-1275, https://doi.org/10.1016/j.phytochem.2003.08.004 . [all data]

Jayaprakasha, Rao, et al., 2003
Jayaprakasha, G.K.; Rao, L.J.M.; Sakariah, K.K., Volatile constituents from Cinnamomum zeylanicum fruit stalks and their antioxidant activities, J. Agric. Food Chem., 2003, 51, 15, 4344-4348, https://doi.org/10.1021/jf034169i . [all data]

Jirovetz, Buchbauer, et al., 2003
Jirovetz, L.; Buchbauer, G.; Shafi, M.P.; Kaniampady, M.M., Chemotaxonomical analysis of the essential oil aroma compounds of four different Ocimumspecies from southern India, Eur. Food Res. Technol., 2003, 217, 2, 120-124, https://doi.org/10.1007/s00217-003-0708-1 . [all data]

Jirovetz, Buchbauer, et al., 2003, 2
Jirovetz, L.; Buchbauer, G.; Shafi, M.P.; Leela, N.K., Analysis of the essential oils of the leaves, stems, rhizomes and roots of the medicinal plant Alpinia galanga from southern India, Acta Pharm. Hung., 2003, 53, 73-81. [all data]

Kanjilal, Kotoky, et al., 2003
Kanjilal, P.B.; Kotoky, R.; Singh, R.S., Chemical composition of the leaf oil of Altingia excelsa Nornha, Flavour Fragr. J., 2003, 18, 5, 449-450, https://doi.org/10.1002/ffj.1250 . [all data]

Lago, de Ávila, et al., 2003
Lago, J.H.G.; de Ávila, P., Jr.; Moreno, P.R.H.; Limberger, R.P.; Apel, M.A.; Henriques, A.T., Analysis, comparison and variation on the chemical composition from the leaf volatile oil of Xylopia aromatica (Annonaceae), Biochem. Syst. Ecol., 2003, 31, 6, 669-672, https://doi.org/10.1016/S0305-1978(02)00267-3 . [all data]

Limberger, Simões-Pires, et al., 2003
Limberger, R.P.; Simões-Pires, C.A.; Sobral, M.; Menut, C.; Bessiere, J.-M.; Henriques, A.T., Essential oils of six Gomidesia spp. from southern Brazil, Flavour Fragr. J., 2003, 18, 2, 144-147, https://doi.org/10.1002/ffj.1122 . [all data]

Marongiu, Porcedda, et al., 2003
Marongiu, B.; Porcedda, S.; Caredda, A.; de Gioannis, B.; Vargiu, L.; la Colla, P., Extraction of Juniperus oxycedrus ssp. Oxycedrus essential oil by supercritical carbon dioxide: influence of some process parameters and biological activity, Flavour Fragr. J., 2003, 18, 5, 390-397, https://doi.org/10.1002/ffj.1224 . [all data]

Pino, Marbot, et al., 2003
Pino, J.A.; Marbot, R.; Fuentes, V., Characterization of volatiles in Bullock's heart (Annona reticulata L.) fruit cultivars from Cuba, J. Agric. Food Chem., 2003, 51, 13, 3836-3839, https://doi.org/10.1021/jf020733y . [all data]

Pourmortazavi, Sefidkon, et al., 2003
Pourmortazavi, S.M.; Sefidkon, F.; Hosseini, S.G., Supercritical carbon dioxide extraction of essential oils from Perovskia atriplicifolia Benth., J. Agric. Food Chem., 2003, 51, 18, 5414-5419, https://doi.org/10.1021/jf0341619 . [all data]

Sefidkon, Naderi Nik, et al., 2003
Sefidkon, F.; Naderi Nik, A.; Bagaii, P.; Javidtash, I., Analysis of the essential oil of Stachys ixodes Boiss. Hausskn. ex Boiss. from Iran, Flavour Fragr. J., 2003, 18, 4, 301-302, https://doi.org/10.1002/ffj.1170 . [all data]

da Silva, Luz, et al., 2003
da Silva, J.D.; Luz, A.I.R.; da Silva, M.H.L.; Andrade, E.H.A.; Soghbi, M.G.B.; Maia, J.G.S., Essential oils of the leaves and stems of four Psidium spp., Flavour Fragr. J., 2003, 18, 3, 240-243, https://doi.org/10.1002/ffj.1219 . [all data]

Farah, Fechtal, et al., 2002
Farah, A.; Fechtal, M.; Chaouch, A., Effet de l'hybridation interspécifique sur la teneur et la composition chimique des huiles essentielles d'eucalyptus cultivés au Maroc, Biotechnol. Agron. Soc. Environ., 2002, 6, 3, 163-169. [all data]

Farah, Fechtal. M., et al., 2002
Farah, A.; Fechtal. M.; Chaouch, A.; Zrira, S., The essential oils of Eucalyptus camaldulensis and its natural hybrid (clone 583) from Morocco, Flavour Fragr. J., 2002, 17, 5, 395-397, https://doi.org/10.1002/ffj.1114 . [all data]

Gudzic, Djokovic, et al., 2002
Gudzic, B.; Djokovic, D.; Vajs, V.; Palic, R.; Stojanovic, G., Composition and antimicrobial activity of the essential oil of Hypericum maculatum Crantz, Flavour Fragr. J., 2002, 17, 5, 392-394, https://doi.org/10.1002/ffj.1112 . [all data]

Iñigo, Palá-Paúl, et al., 2002
Iñigo, A.; Palá-Paúl, J.; Pérez-Alonso, M.J.; Velasco-Negueruela, A., Essential oil composition from the aerial parts of Haplophyllum linifolium (L.) G. Don fil., Botanica Complutensis, 2002, 26, 79-83. [all data]

Juteau, Masotti, et al., 2002
Juteau, F.; Masotti, V.; Bessière, J.-M., Compositional characteristics of the essential oil of Artemisia campestris var. glutinosa, Biochem. Syst. Ecol., 2002, 30, 11, 1065-1070, https://doi.org/10.1016/S0305-1978(02)00052-2 . [all data]

Kabouss, Charrouf, et al., 2002
Kabouss, A.E.; Charrouf, Z.; Faid, M.; Garneau, F.-X.; Collin, G., Chemical composition and antimicrobial activity of the leaf essential oil of Argania spinosa L. Skeels, J. Essent. Oil Res., 2002, 14, 2, 147-149, https://doi.org/10.1080/10412905.2002.9699801 . [all data]

Kobaisy, Tellez, et al., 2002
Kobaisy, M.; Tellez, M.R.; Dayan, F.E.; Duke, S.O., Phytotoxicity and volatile constituents from leaves of Callicarpa japonica Thunb., Phytochemistry, 2002, 61, 1, 37-40, https://doi.org/10.1016/S0031-9422(02)00207-8 . [all data]

Krauze-Baranowska, Mardarowicz, et al., 2002
Krauze-Baranowska, M.; Mardarowicz, M.; Wiwart, M., The chemical composition of Microbiota decussata, Z. Naturforsch. C:, 2002, 57c, 998-1003. [all data]

Lago, Reis, et al., 2002
Lago, J.H.G.; Reis, A.A.; Roque, N.F., Chemical composition from volatile oil of the stem bark of Guarea macrophylla Vahl. ssp. tuberculata Vellozo (Meliaceae), Flavour Fragr. J., 2002, 17, 4, 255-257, https://doi.org/10.1002/ffj.1091 . [all data]

Limberger, Simões-Pires, et al., 2002
Limberger, R.P.; Simões-Pires, C.; Sobral, M.; Menu, C.; Bessiere, J.-M.; Henriques, A.T., Essential oils from some Myrceugenia species (Myrtaceae), Flavour Fragr. J., 2002, 17, 5, 341-344, https://doi.org/10.1002/ffj.1113 . [all data]

Maia, da Silva, et al., 2002
Maia, J.G.S.; da Silva, M.H.L.; Andrade, E.H.A.; Zoghbi, M.G.B.; Carreira, L.M.M., Essential oils from Astronium urundeuva (Allemao) Engl. and A. fraxinifolium Schott ex Spreng., Flavour Fragr. J., 2002, 17, 1, 72-74, https://doi.org/10.1002/ffj.1046 . [all data]

Maia, Zoghbi, et al., 2002
Maia, J.G.S.; Zoghbi, M.G.B.; Andrade, E.H.A.; da Silva, M.H.L.; Luz, A.I.R.; da Silva, J.D., Essential oils composition of Eupatorium species growing wild in the Amazon, Biochem. Syst. Ecol., 2002, 30, 11, 1071-1077, https://doi.org/10.1016/S0305-1978(02)00059-5 . [all data]

Morteza-Semnani, Saeedi, et al., 2002
Morteza-Semnani, K.; Saeedi, M.; Vahedi, M., Volatile constituents of Iranian Hypericum perfloratum L., Oriental J. Chem., 2002, 18, 3, 443-444. [all data]

Palá-Paúl, Pérez-Alonso, et al., 2002
Palá-Paúl, J.; Pérez-Alonso, M.J.; Velasco-Negueruela, A.; Sanz, J., Analysis by gas chromatography-mass spectrometry of the volatile components of Ageratina adenophora Spreng., growing in the Canary Islands, J. Chromatogr. A, 2002, 947, 2, 327-331, https://doi.org/10.1016/S0021-9673(02)00016-X . [all data]

Sefidkon, Dabiri, et al., 2002
Sefidkon, F.; Dabiri, M.; Alamshahi, A., Analysis of the essential oil of Nepeta fissa C.A. Mey from Iran, Flavour Fragr. J., 2002, 17, 2, 89-90, https://doi.org/10.1002/ffj.1045 . [all data]

Sefidkon, Jalili, et al., 2002
Sefidkon, F.; Jalili, A.; Mirhaji, T., Essential oil composition of three Artemisia spp. from Iran, Flavour Fragr. J., 2002, 17, 2, 150-152, https://doi.org/10.1002/ffj.1063 . [all data]

Sefidkon, 2002
Sefidkon, F., Essential oil of Lantana camara L. occurring in Iran, Flavour Fragr. J., 2002, 17, 1, 78-80, https://doi.org/10.1002/ffj.1048 . [all data]

Zoghbi, Andrade, et al., 2002
Zoghbi, M.G.B.; Andrade, E.H.A.; da Silva, M.H.L.; Maia, J.G.S., Volatile constituents of Lippia lupulina Cham., Flavour Fragr. J., 2002, 17, 1, 29-31, https://doi.org/10.1002/ffj.1032 . [all data]

Bailac, Dellacasa, et al., 2001
Bailac, P.N.; Dellacasa, A.D.; Bernasconi, H.O.; Ponzi, M.I.; Firpo, N.H., Essential oil of female plants of Baccharis coridifolia De Candole, J. Essent. Oil Res., 2001, 13, 1, 23-24, https://doi.org/10.1080/10412905.2001.9699593 . [all data]

Dabiri and Sefidkon, 2001
Dabiri, M.; Sefidkon, F., Analysis of the essential oil from aerial parts of Perovskia atriplicifolia Benth. at different stages of plant growth, Flavour Fragr. J., 2001, 16, 6, 435-438, https://doi.org/10.1002/ffj.988 . [all data]

Gallori, Flamini, et al., 2001
Gallori, S.; Flamini, G.; Bilia, A.R.; Morelli, I.; Landini, A.; Vincieri, F.F., Chemical composition of some traditional herbal drug preparations: essential oil and aromatic water of costmary (Balsamita suaveolens Pers.), J. Agric. Food Chem., 2001, 49, 12, 5907-5910, https://doi.org/10.1021/jf0107656 . [all data]

Jacquemond-Collet, Bessière, et al., 2001
Jacquemond-Collet, I.; Bessière, J.-M.; Hannedouche, S.; Bertrand, C.; Fourasté, I.; Moulis, C., Identification of the alkaloids of Galipea officinalis by gas chromatography-mass spectrometry, Phytochem. Anal., 2001, 12, 5, 312-319, https://doi.org/10.1002/pca.594 . [all data]

Jirovetz L., Buchbauer G., et al., 2001
Jirovetz L.; Buchbauer G.; Shafi P.M.; Rosamma M.K.; Geissler M., Analysis of the composition and aroma of the essential leaf oil of Syzygium travancoricum from South India by GC-FID, GC-MS, and olfactometry. Seasonal changes of composition, Chromatographia Sup., 2001, 53, S1, s372-s374, https://doi.org/10.1007/BF02490359 . [all data]

Kalemba, Marschall, et al., 2001
Kalemba, D.; Marschall, H.; Bradesi, P., Constituents of the essential oil of Solidago gigantea Ait. (giant goldenrod), Flavour Fragr. J., 2001, 16, 1, 19-26, https://doi.org/10.1002/1099-1026(200101/02)16:1<19::AID-FFJ940>3.0.CO;2-U . [all data]

Marongiu, Porcedda, et al., 2001
Marongiu, B.; Porcedda, S.; Porta, G.D.; Reverchon, E., Extraction and isolation of Salvia desoleana and Mentha spicata subsp. insularis essential oils by supercritical CO2, Flavour Fragr. J., 2001, 16, 5, 384-388, https://doi.org/10.1002/ffj.1021 . [all data]

Rousis, Papadogianni, et al., 2001
Rousis, V.; Papadogianni, K.; Vagias, C.; Harvala, C.; Petrakis, P.V.; Ortiz, A., Volatile constituents of three Pinus species grown in Greece, J. Essent. Oil Res., 2001, 13, 2, 118-121, https://doi.org/10.1080/10412905.2001.9699632 . [all data]

Santos, Moreira, et al., 2001
Santos, P.R.; Moreira, D.L.; Guimaraes, E.F.; Kaplan, M.A.C., Essential oil analysis of 10 piperaceae species from the Brazilian Atlantic forest, Phytochemistry, 2001, 58, 4, 547-551, https://doi.org/10.1016/S0031-9422(01)00290-4 . [all data]

Vijayanand, Rao, et al., 2001
Vijayanand, P.; Rao, L.J.M.; Narasimham, P., Volatile flavour components of jamun fruit (Syzygium cumini L), Flavour Fragr. J., 2001, 16, 1, 47-49, https://doi.org/10.1002/1099-1026(200101/02)16:1<47::AID-FFJ944>3.0.CO;2-L . [all data]

Mallavarapu, Rao, et al., 2000
Mallavarapu, G.R.; Rao, L.; Ramesh, S., Volatile constituents of the leaf and fruit oils of Murraya koenigii Spreng., L. Ess. Oil Res., 2000, 12, 6, 766-768, https://doi.org/10.1080/10412905.2000.9712211 . [all data]

Novak, Novak, et al., 2000
Novak, J.; Novak, S.; Bitsch, C.; Franz, C.M., Essential oil composition of underground parts of Valeriana celtica ssp. from Austria and Italy, Flavour Fragr. J., 2000, 15, 1, 40-42, https://doi.org/10.1002/(SICI)1099-1026(200001/02)15:1<40::AID-FFJ863>3.0.CO;2-B . [all data]

Bailac, Dellacasa, et al., 1999
Bailac, P.N.; Dellacasa, A.D.; Duschatzky, C.B.; Firpo, N.; Ponzi, M.I., Composicion del aceite esencial y actividad antimicrobiana de Aloysia gratissima de San Luis - Argentina, An. Asoc. Quim. Argent., 1999, 87, 3/4, 149-153. [all data]

Menon, Chacko, et al., 1999
Menon, A.N.; Chacko, S.; Narayanan, C.S., Free and glycosidically bound volatiles of cardamom (Eletteria cardamomum Maton var. miniscula Burkill), Flavour Fragr. J., 1999, 14, 1, 65-68, https://doi.org/10.1002/(SICI)1099-1026(199901/02)14:1<65::AID-FFJ789>3.0.CO;2-A . [all data]

Oyedeji, Olawore, et al., 1999
Oyedeji, A.O.; Olawore, O.N.; Ekundayo, O.; Koenig, W.A., Volatile leaf oil constituents of three Eucalyptus species from Nigeria, Flavour Fragr. J., 1999, 14, 4, 241-244, https://doi.org/10.1002/(SICI)1099-1026(199907/08)14:4<241::AID-FFJ820>3.0.CO;2-Y . [all data]

Porta, Porcedda, et al., 1999
Porta, G.D.; Porcedda, S.; Marongiu, B.; Reverchon, E., Isolation of eucalyptus oil by supercritical fluid extraction, Flavour Fragr. J., 1999, 14, 4, 214-218, https://doi.org/10.1002/(SICI)1099-1026(199907/08)14:4<214::AID-FFJ814>3.0.CO;2-H . [all data]

Zoghbi, Andrade, et al., 1999
Zoghbi, M.G.B.; Andrade, E.H.A.; Maia, J.G.S., The essential oil of Vitex angus-castus L. growing in the Amazon region, Flavour Fragr. J., 1999, 14, 4, 211-213, https://doi.org/10.1002/(SICI)1099-1026(199907/08)14:4<211::AID-FFJ812>3.0.CO;2-W . [all data]

Kökdil, Kurucu, et al., 1998
Kökdil, G.; Kurucu, S.; Yildiz, A., Essential oil composition of Nepeta nuda L. ssp. nuda, Flavour Fragr. J., 1998, 13, 4, 233-234, https://doi.org/10.1002/(SICI)1099-1026(1998070)13:4<233::AID-FFJ730>3.0.CO;2-7 . [all data]

Lamarque, Maestri, et al., 1998
Lamarque, A.L.; Maestri, D.M.; Zygadlo, J.A.; Grosso, N.R., Volatile constituents from flowers of Acacia caven (Mol.) Mol. var. caven, Acacia aroma Gill. ex Hook., Erythrina crista-galli L. and Calliandra tweedii Benth., Flavour Fragr. J., 1998, 13, 4, 266-268, https://doi.org/10.1002/(SICI)1099-1026(1998070)13:4<266::AID-FFJ739>3.0.CO;2-5 . [all data]

Maia, Zohhbi, et al., 1998
Maia, J.G.S.; Zohhbi, M.G.B.; Andrade, E.H.A.; Santos, A.S.; da Silva, M.H.L.; Luz, A.I.R.; Bastos, C.N., Constituents of the essential oil of Piper aduncum L. growing wild in the Amazon region, Flavour Fragr. J., 1998, 13, 4, 269-272, https://doi.org/10.1002/(SICI)1099-1026(1998070)13:4<269::AID-FFJ744>3.0.CO;2-A . [all data]

Santos, Andrade, et al., 1998
Santos, A.S.; Andrade, E.H.A.; Zoghbi, M. das.G.B.; Luz, A.I.R.; Maia, J.G.S., Sesquiterpenes of Amazonian Piper species, Acta Amazomica, 1998, 28, 2, 127-130. [all data]

Stashenko, Cervantes, et al., 1998
Stashenko, E.E.; Cervantes, M.; Combariza, Y.; Martínez, J.R., HRGC-FID-MSD Analysis of the Secondary Metabolites Obtained by Different Extraction Methods from Lepechinia schiedeana, and Evaluation of its Antioxidant Activity in vitro in 20th International Symposium on Capillary Chromatography, 1998, 1-11. [all data]

Zygadlo, Ariza-Espinar, et al., 1997
Zygadlo, J.A.; Ariza-Espinar, L.; Velasco-Negueruela, A.; Perez-Alonso, M.J., Volatile constituents of Stevia achalensis hieronymus, Flavour Fragr. J., 1997, 12, 4, 297-299, https://doi.org/10.1002/(SICI)1099-1026(199707)12:4<297::AID-FFJ625>3.0.CO;2-2 . [all data]

Ramanoelina, Viano, et al., 1994
Ramanoelina, P.A.R.; Viano, J.; Bianchini, J.-P.; Gaydou, E.M., Occurrence of various chemotypes in Niaouli (Melaleuca quinquenervia) essential oils from Madagascar using multivariate statistical analysis, J. Agric. Food Chem., 1994, 42, 5, 1177-1182, https://doi.org/10.1021/jf00041a024 . [all data]

Binder and Flath, 1989
Binder, R.G.; Flath, R.A., Volatile components of pineapple guava, J. Agric. Food Chem., 1989, 37, 3, 734-736, https://doi.org/10.1021/jf00087a034 . [all data]

Brophy, Davies, et al., 1989
Brophy, J.J.; Davies, N.W.; Southwell, I.A.; Stiff, I.A.; Williams, L.R., Gas chromatographic quality control for oil of Melaleuca terpinen-4-ol type (Australian tea tree), J. Agric. Food Chem., 1989, 37, 5, 1330-1335, https://doi.org/10.1021/jf00089a027 . [all data]