Platinum, bis(trimethylphosphine)dimethyl-

Gas phase ion energetics data

Data compiled as indicated in comments:
LL - Sharon G. Lias and Joel F. Liebman
LLK - Sharon G. Lias, Rhoda D. Levin, and Sherif A. Kafafi

Ionization energy determinations

IE (eV) Method Reference Comment
7.34PEYang, Bancroft, et al., 1990Vertical value; LL
7.68PEBehan, Johnstone, et al., 1978Vertical value; LLK

References

Yang, Bancroft, et al., 1990
Yang, D.S.; Bancroft, M.; Dignard-Bailey, L.; Puddephatt, R.J.; Tse, J.S., Electronic structure of cis-Dimethylplatinum(II) complexes from UV photoelectron spectra and SCF-MS-Xa calculations, Inorg. Chem., 1990, 29, 2487. [all data]

Behan, Johnstone, et al., 1978
Behan, J.; Johnstone, R.A.W.; Puddephatt, R.J., Photoelectron spectra and reactivity of methyl (tertiary phosphine)-platinum and -gold complexes, J. Chem. Soc., Chem. Commun., 1978, 444. [all data]