2-Butanamine, (S)-

Phase change data

Data compiled as indicated in comments:
BS - Robert L. Brown and Stephen E. Stein

Quantity Value Units Method Reference Comment
Tboil336.2KN/AWeast and Grasselli, 1989BS
Tboil336.1KN/AMajer and Svoboda, 1985
Quantity Value Units Method Reference Comment
Tc509.4KN/AMajer and Svoboda, 1985
Quantity Value Units Method Reference Comment
Δvap7.851kcal/molN/AMajer and Svoboda, 1985

Enthalpy of vaporization

ΔvapH (kcal/mol) Temperature (K) Reference Comment
7.151336.1Majer and Svoboda, 1985

Enthalpy of vaporization

ΔvapH = A exp(-βTr) (1 − Tr)β
    ΔvapH = Enthalpy of vaporization (at saturation pressure) (kcal/mol)
    Tr = reduced temperature (T / Tc)

View plot Requires a JavaScript / HTML 5 canvas capable browser.

Temperature (K) A (kcal/mol) β Tc (K) Reference Comment
298. - 343.12.560.324509.4Majer and Svoboda, 1985

References

Weast and Grasselli, 1989
CRC Handbook of Data on Organic Compounds, 2nd Editon, Weast,R.C and Grasselli, J.G., ed(s)., CRC Press, Inc., Boca Raton, FL, 1989, 1. [all data]

Majer and Svoboda, 1985
Majer, V.; Svoboda, V., Enthalpies of Vaporization of Organic Compounds: A Critical Review and Data Compilation, Blackwell Scientific Publications, Oxford, 1985, 300. [all data]