1-Butanol, 4-[(tetrahydro-2H-pyran-2-yl)oxy]-

Van Den Dool and Kratz RI, non-polar column, temperature ramp

View large format table.

Column type Active phase I Reference Comment
CapillaryBPX-51395.Dickschat J.S., Wagner-Dobler I., et al., 200525. m/0.25 mm/0.25 μm, He, 50. C @ 5. min, 5. K/min; Tend: 300. C

Normal alkane RI, polar column, temperature ramp

View large format table.

Column type Active phase I Reference Comment
CapillaryDB-Wax1465.Souza, Re-Poppi, et al., 201230. m/0.25 mm/0.25 μm, Helium, 60. C @ 1. min, 5. K/min; Tend: 240. C

References

Dickschat J.S., Wagner-Dobler I., et al., 2005
Dickschat J.S.; Wagner-Dobler I.; Schulz S., The chafer pheromone buibuilactone and ant pyrazines are also produced by marine bacteria, J. Chem. Ecol., 2005, 31, 4, 925-947, https://doi.org/10.1007/s10886-005-3553-9 . [all data]

Souza, Re-Poppi, et al., 2012
Souza, J.B.G.; Re-Poppi, N.; Raposo, J.L.(Jr)., Characterization of pyroligneous acid used in agriculture by gas chromatography - mass spectrometry (in press), J. Braz. Chem. Soc., 2012, 00, 00, 1-8. [all data]