Octyl tert-butyl ether

Phase change data

Data compiled by: William E. Acree, Jr., James S. Chickos

Quantity Value Units Method Reference Comment
Δvap61.4kJ/molCGCVerevkin, Krasnykh, et al., 2003See also Verevkin, 2002 and Verevkin, Krasnykh, et al., 2003.

References

Verevkin, Krasnykh, et al., 2003
Verevkin, Sergey P.; Krasnykh, Eugen L.; Vasiltsova, Tatiana V.; Heintz, Andreas, Determination of Ambient Temperature Vapor Pressures and Vaporization Enthalpies of Branched Ethers, J. Chem. Eng. Data, 2003, 48, 3, 591-599, https://doi.org/10.1021/je0255980 . [all data]

Verevkin, 2002
Verevkin, Sergey P., Improved Benson Increments for the Estimation of Standard Enthalpies of Formation and Enthalpies of Vaporization of Alkyl Ethers, Acetals, Ketals, and Ortho Esters, J. Chem. Eng. Data, 2002, 47, 5, 1071-1097, https://doi.org/10.1021/je020023o . [all data]