Bicyclo[3.1.0]hexan-2-one, 5-(1-methylethyl)-

Kovats' RI, non-polar column, temperature ramp

View large format table.

Column type Active phase I Reference Comment
CapillaryDB-51158.Lucero, Fredrickson, et al., 200630. m/0.25 mm/0.25 μm, He, 3. K/min; Tstart: 60. C
CapillaryDB-51156.Adams and Nguyen, 200530. m/0.26 mm/0.25 μm, He, 3. K/min; Tstart: 60. C; Tend: 246. C
CapillarySE-541156.Adams, 200030. m/0.26 mm/0.25 μm, He, 3. K/min; Tstart: 60. C; Tend: 246. C
CapillaryDB-51156.Adams, 2000, 230. m/0.26 mm/0.25 μm, He, 3. K/min; Tstart: 60. C; Tend: 240. C
CapillarySE-541156.Adams, 2000, 330. m/0.26 mm/0.25 μm, 3. K/min; Tstart: 60. C; Tend: 246. C
CapillaryDB-51156.Adams, 2000, 430. m/0.26 mm/0.25 μm, He, 3. K/min; Tstart: 60. C; Tend: 246. C
CapillaryDB-51156.Adams, 199930. m/0.26 mm/0.25 μm, He, 3. K/min; Tstart: 60. C; Tend: 246. C

Kovats' RI, non-polar column, custom temperature program

View large format table.

Column type Active phase I Reference Comment
CapillaryDB-5MS1155.Tuberoso, Kowalczyk, et al., 200530. m/0.25 mm/0.25 μm, He; Program: 60C(5min) => 2C/min => 140C= 5C/min => 250C(5min)
CapillaryOV-11151.El-Shazly, Dorai, et al., 200215. m/0.317 mm/0.25 μm, He; Program: 50C(4min) => (4C/min) => 90C => (10C/min)=300C(10min)

Van Den Dool and Kratz RI, non-polar column, temperature ramp

View large format table.

Column type Active phase I Reference Comment
CapillaryDB-51147.Dob, Dahmane, et al., 200630. m/0.32 mm/0.25 μm, N2, 60. C @ 3. min, 3. K/min, 240. C @ 5. min
CapillaryHP-5MS1142.Kallio, Jussila, et al., 200620. m/0.25 mm/0.25 μm, 60. C @ 4. min, 5. K/min, 240. C @ 15. min
CapillaryRTX-11132.Cozzani, Muselli, et al., 200560. m/0.22 mm/0.25 μm, 2. K/min, 220. C @ 20. min; Tstart: 60. C
CapillarySPB-11126.Antunes, Sevinate-Pinto, et al., 200430. m/0.25 mm/0.25 μm, He, 3. K/min, 220. C @ 15. min; Tstart: 70. C
CapillaryRTX-51160.Shellie, Mondello, et al., 200230. m/0.25 mm/0.25 μm, He, 45. C @ 6. min, 3. K/min; Tend: 250. C
CapillaryRTX-51165.Shellie, Mondello, et al., 200230. m/0.25 mm/0.25 μm, He, 45. C @ 6. min, 3. K/min; Tend: 250. C

Van Den Dool and Kratz RI, non-polar column, custom temperature program

View large format table.

Column type Active phase I Reference Comment
CapillaryBPX-51179.Cardeal, da Silva, et al., 200630. m/0.25 mm/0.25 μm; Program: 35C(5min) => 3C/min => 210C => 40C/min => 240C (4min)

Van Den Dool and Kratz RI, polar column, temperature ramp

View large format table.

Column type Active phase I Reference Comment
CapillaryRTX-Wax1606.Cozzani, Muselli, et al., 200560. m/0.22 mm/0.25 μm, 2. K/min, 220. C @ 20. min; Tstart: 60. C
CapillaryDB-Wax1683.Njoroge, Koaze, et al., 200560. m/0.25 mm/0.25 μm, N2, 70. C @ 2. min, 2. K/min, 230. C @ 20. min
CapillaryCP-Wax 52CB1675.Chyau, Mau, et al., 199650. m/0.23 mm/0.12 μm, H2, 50. C @ 10. min, 1.5 K/min, 200. C @ 10. min

Normal alkane RI, non-polar column, temperature ramp

View large format table.

Column type Active phase I Reference Comment
CapillaryHP-5 MS1154.Lazarevic, Radulovic, et al., 201030. m/0.25 mm/0.25 μm, Helium, 5. K/min; Tstart: 70. C; Tend: 290. C
CapillaryHP-5 MS1160.Radulovic, Dordevic, et al., 201030. m/0.25 mm/0.25 μm, Helium, 5. K/min, 290. C @ 10. min; Tstart: 70. C
CapillaryDB-51156.Bos, Woerdenbag, et al., 200730. m/0.26 mm/0.25 μm, He, 3. K/min; Tstart: 60. C; Tend: 240. C
CapillaryDB-51156.Elfami, Bos, et al., 200730. m/0.26 mm/0.25 μm, Helium, 3. K/min; Tstart: 60. C; Tend: 290. C
CapillaryHP-5 MS1159.Vagionas, Graikou, et al., 200730. m/0.25 mm/0.25 μm, Helium, 3. K/min; Tstart: 60. C; Tend: 280. C
CapillaryDB-51156.Elfami, Komar, et al., 200630. m/0.26 mm/0.25 μm, Helium, 3. K/min; Tstart: 60. C; Tend: 290. C
CapillaryHP-51159.Figuérédo, Cabassu, et al., 200630. m/0.25 mm/0.25 μm, He, 50. C @ 5. min, 5. K/min, 300. C @ 5. min
CapillaryDB-51156.Bos, Stojanova, et al., 200530. m/0.249 mm/0.25 μm, He, 3. K/min; Tstart: 60. C; Tend: 290. C
CapillaryHP-51153.Duarte, Figueira, et al., 200525. m/0.2 mm/0.33 μm, He, 3. K/min, 240. C @ 7. min; Tstart: 60. C
CapillaryDB-51156.Özel, Gögüs, et al., 200530. m/0.32 mm/0.25 μm, He, 40. C @ 0.5 min, 5. K/min, 250. C @ 2. min
CapillaryDB-11147.Rasooli and Owlia, 200560. m/0.25 mm/0.25 μm, He, 4. K/min; Tstart: 50. C; Tend: 250. C
CapillarySE-541153.Kilic, Hafizoglu, et al., 200430. m/0.25 mm/0.25 μm, He, 60. C @ 5. min, 2. K/min; Tend: 260. C
CapillaryDB-11147.Rasooli and Razzaghi Abyaneh, 200460. m/0.25 mm/0.25 μm, He, 4. K/min; Tstart: 50. C; Tend: 250. C
CapillaryHP-51154.Ghannadi and Zolfaghari, 200330. m/0.25 mm/0.25 μm, He, 4. K/min; Tstart: 60. C; Tend: 275. C
CapillaryDB-51153.Masotti, Juteau, et al., 200350. m/0.2 mm/0.25 μm, He, 50. C @ 2. min, 3. K/min; Tend: 220. C
CapillaryDB-11143.Perez-Alonso, Velasco-Negueruela, et al., 200350. m/0.25 mm/0.25 μm, N2, 4. K/min; Tstart: 95. C; Tend: 240. C
CapillaryDB-51158.Pino, Marbot, et al., 200330. m/0.25 mm/0.25 μm, H2, 60. C @ 10. min, 4. K/min, 280. C @ 40. min
CapillaryHP-51158.Gallori, Flamini, et al., 200130. m/0.25 mm/0.25 μm, N2, 60. C @ 10. min, 5. K/min; Tend: 220. C
CapillarySPB-51187.Doneanu and Anitescu, 199850. m/0.32 mm/0.25 μm, He, 3. K/min, 240. C @ 20. min; Tstart: 60. C

Normal alkane RI, non-polar column, custom temperature program

View large format table.

Column type Active phase I Reference Comment
CapillaryDB-11114.Albano, Lima, et al., 201230. m/0.25 mm/0.25 μm, Hydrogen; Program: 45 0C 3 0C/min -> 175 0C 15 0C/min -> 300 0C (10 min)
CapillaryHP-5 MS1160.Chu, Liu, et al., 201130. m/0.25 mm/0.25 μm, Helium; Program: 60 0C (1 min) 10 0C -> 180 0C (1 min) 20 0C/min -> 280 0C (15 min)
CapillaryDB-51156.Nezhadali and Parsa, 201030. m/0.20 mm/0.32 μm, Helium; Program: 60 0C (1 min) 3 0C/min -> 140 0C 50 0C/min -> 250 0C (3 min)
CapillarySLB-5 MS1157.Costa, De Fina, et al., 200830. m/0.25 mm/0.25 μm, Helium; Program: 50 0C 3 0C/min -> 250 0C (1 min) 10 0C/min -> 300 0C (5 min)
CapillarySLB-5 MS1154.Costa, De Fina, et al., 200830. m/0.25 mm/0.25 μm, Helium; Program: not specified

Normal alkane RI, polar column, temperature ramp

View large format table.

Column type Active phase I Reference Comment
CapillaryCP Wax 52 CB1632.Chen, Chyau, et al., 200760. m/0.25 mm/0.25 μm, Helium, 3. K/min; Tstart: 40. C; Tend: 220. C
CapillaryHP-Innowax1647.Hachicha, Skanji, et al., 200730. m/0.25 mm/0.25 μm, He, 2. K/min, 240. C @ 20. min; Tstart: 60. C
CapillaryDB-Wax1683.Njoroge, Koaze, et al., 2005, 260. m/0.25 mm/0.25 μm, N2, 70. C @ 2. min, 2. K/min, 230. C @ 20. min
CapillaryInnowax1651.Suleimenov, Atazharova, et al., 2003He, 60. C @ 10. min, 4. K/min, 220. C @ 10. min; Column length: 60. m; Column diameter: 0.25 mm

Normal alkane RI, polar column, custom temperature program

View large format table.

Column type Active phase I Reference Comment
CapillaryHP Innowax1652.Noorizadeh and Farmany, 201060. m/0.25 mm/0.33 μm; Program: not specified
CapillaryInnowax FSC1651.Polatoglu, Demirci, et al., 201060. m/0.25 mm/0.25 μm, Helium; Program: 60 0C (10 min) 4 0C/min -> 220 0C (10 min) 1 0C/min -> 240 0C
CapillaryInnowax FSC1651.Baser, Demirci, et al., 200960. m/0.25 mm/0.25 μm, Helium; Program: 60 0C (10 min) 4 0C/min -> 220 0C (10 min) 1 0C/min -> 240 0C
CapillaryHP Innowax FSP1651.Tabanca N., Demirci B., et al., 200760. m/0.25 mm/0.25 μm, N2; Program: 60C(10min) => 4C/min => 220C(10min) => 1C/min => 240C
CapillaryHP-Innowax FSC1651.Kürkçüoglu, Hüsnü Can Baser, et al., 200660. m/0.25 mm/0.25 μm, He; Program: 60C(10min) => 4C/min => 220C (10min) => 1C/min => 240C
CapillaryHP-Innowax FSC1651.Suleimenov Y.M., Atazhanova G.A., et al., 200660. m/0.25 mm/0.25 μm, He; Program: 60(10min) => 4C/min => 220C(10min) => 1C/min => 240C
CapillaryHP-Innowax FSC1651.Tabanca, Demirci, et al., 200660. m/0.25 mm/0.25 μm; Program: 60C(10min) => 4C/min => 220C (10min) => 1C/min => 240C
CapillaryHP-Innowax1651.Demirci, Demirci, et al., 200560. m/0.25 mm/0.25 μm, N2; Program: 60C(10min) => 4C/min => 220C (10min) => 1C/min => 240C
CapillaryInnowax FSC1651.Baser, Demirci, et al., 200360. m/0.25 mm/0.25 μm, He; Program: 60C(10min) => 4C/min => 220C (10min) => 1C/min => 240C
CapillaryHP-Innowax1651.Viljoen, van Vuuren, et al., 200360. m/0.25 mm/0.25 μm; Program: 60C(10min) => 4C/min => 220C(10min) => 1C/min => 240C
CapillaryHP-Innowax FSC1651.Hüsnü Can Baser, Demirci, et al., 200260. m/0.25 mm/0.25 μm, N2; Program: 60C(10min) => 4C/min => 220C(10min) => 1C/min => 240C
CapillaryInnowax FSC1651.Tunalier, Kirimer, et al., 200260. m/0.25 mm/0.25 μm; Program: 60C(10min) => 4C/min => 220C(10min) => 1C/min => 240C
CapillaryHP-Innowax1651.Baser, Demirci, et al., 200160. m/0.25 mm/0.25 μm, He; Program: 60 0C (10 min) 10 K/min -> 220 0C (10 min) 1K/min -> 240 0C
CapillaryHP-Innowax1651.Gören, Demirci, et al., 200160. m/0.25 mm/0.25 μm, He; Program: 60 0C (10 min) 4 K/min -> 220 0C (10 min) 1 K/min -> 240 0C
CapillaryInnowax1651.Özcan, Akgül, et al., 200160. m/0.25 mm/0.25 μm, He; Program: 60C(10min) => 4C/min => 200C(10min) => 1C/min => 240C
CapillaryInnowax1651.Baser, Tabanca, et al., 200060. m/0.25 mm/0.25 μm, He; Program: 60 0C (10 min) 4 K/min -> 220 0C (10 min) 1 K/min -> 240 0C

References

Lucero, Fredrickson, et al., 2006
Lucero, M.E.; Fredrickson, E.L.; Estell, R.E.; Morrison, A.A.; Richman, D.B., Volatile Composition of Gutierrezia sarothrae (Broom Snakeweed) as Determined by Steam Distillation and Solid Phase Microextraction, J. Essent. Oil Res., 2006, 18, 2, 121-125, https://doi.org/10.1080/10412905.2006.9699039 . [all data]

Adams and Nguyen, 2005
Adams, R.P.; Nguyen, S., Infra-specific variation in Juniperus deppeana and F. Sperryi in the Davis Mountains of Texas: variation in leaf essential oils and random amplified polymorphic DNAS (RAPDS), Phytologia, 2005, 87, 2, 96-108. [all data]

Adams, 2000
Adams, R.P., Systematics of smooth leaf margin Juniperus of the western hemisphere based on leaf essential oils and RAPD DNA fingerprinting, Biochem. Syst. Ecol., 2000, 28, 2, 149-162, https://doi.org/10.1016/S0305-1978(99)00047-2 . [all data]

Adams, 2000, 2
Adams, R.P., Systematics of Juniperus section Juniperus based on leaf essential oils and random amplified polymorphic DNAs (RAPDs), Biochem. Syst. Ecol., 2000, 28, 6, 515-528, https://doi.org/10.1016/S0305-1978(99)00089-7 . [all data]

Adams, 2000, 3
Adams, R.P., Systematics of the one seeded Juniperus of the eastern hemisphere based on leaf essential oils and random amplified polymorphic DNAs (RAPDs), Biochem. Syst. Ecol., 2000, 28, 6, 529-543, https://doi.org/10.1016/S0305-1978(99)00096-4 . [all data]

Adams, 2000, 4
Adams, R.P., The serrate leaf margined Juniperus (Section Sabina) of the western hemisphere: systematics and evolution based on leaf essential oils and Random Amplified Polymorphic DNAs (RAPDs), Biochem. Syst. Ecol., 2000, 28, 10, 975-989, https://doi.org/10.1016/S0305-1978(00)00022-3 . [all data]

Adams, 1999
Adams, R.P., Systematics of multi-seeded eastern hemisphere Juniperus based on leaf essential oils and RAPD DNA fingerprinting, Biochem. Syst. Ecol., 1999, 27, 7, 709-725, https://doi.org/10.1016/S0305-1978(99)00016-2 . [all data]

Tuberoso, Kowalczyk, et al., 2005
Tuberoso, C.I.G.; Kowalczyk, A.; Coroneo, V.; Russo, M.T.; Dessì, S.; Cabras, P., Chemical Composition and Antioxidant, Antimicrobial, and Antifungal Activities of the Essential Oil of Achillea ligustica All., J. Agric. Food Chem., 2005, 53, 26, 10148-10153, https://doi.org/10.1021/jf0518913 . [all data]

El-Shazly, Dorai, et al., 2002
El-Shazly, A.; Dorai, G.; Wink, M., Chemical composition and biological activity of the essential oils of Senecio aegyptus var. discoideus Boiss., Z. Naturforsch., 2002, 57c, 434-439. [all data]

Dob, Dahmane, et al., 2006
Dob, T.; Dahmane, D.; Chelghoum, C., Essential oil composition of Juniperus oxycedrus growing in Algeria, Pharm. Biol., 2006, 44, 1, 1-6, https://doi.org/10.1080/13880200500530922 . [all data]

Kallio, Jussila, et al., 2006
Kallio, M.; Jussila, M.; Rissanen, T.; Anttila, P.; Hartonen, K.; Reissell, A.; Vreuls, R.; Adahchour, M.; Hyotylainen, T., Comprehensive two-dimensional gas chromatography coupled to time-of-flight mass spectrometry in the identification of organic compounds in atmospheric aerosols from coniferous forest, J. Chromatogr. A, 2006, 1125, 2, 234-243, https://doi.org/10.1016/j.chroma.2006.05.050 . [all data]

Cozzani, Muselli, et al., 2005
Cozzani, S.; Muselli, A.; Desjobert, J.-M.; Bernardini, A.-F.; Tomi, F.; Casanova, J., Chemical composition of essential oil of Teucrium polium subsp. capitatum (L.) from Corsica, Flavour Fragr. J., 2005, 20, 4, 436-441, https://doi.org/10.1002/ffj.1463 . [all data]

Antunes, Sevinate-Pinto, et al., 2004
Antunes, T.; Sevinate-Pinto, I.; Barroso, J.G.; Cavaleiro, C.; Salgueiro, L.R., Micromorphology of trichomes and composition of essential oil of Teucrium capitatum, Flavour Fragr. J., 2004, 19, 4, 336-340, https://doi.org/10.1002/ffj.1310 . [all data]

Shellie, Mondello, et al., 2002
Shellie, R.; Mondello, L.; Marriott, P.; Dugo, G., Characterisation of lavender essential oils by using gas chromatography-mass spectrometry with correlation of linear retention indices and comparison with comprehensive two-dimensional gas chromatography, J. Chromatogr. A, 2002, 970, 1-2, 225-234, https://doi.org/10.1016/S0021-9673(02)00653-2 . [all data]

Cardeal, da Silva, et al., 2006
Cardeal, Z.L.; da Silva, M.D.R.G.; Marriott, P.J., Comprehensive two-dimensional gas chromatography/mass spectrometric analysis of pepper volatiles, Rapid Commun. Mass Spectrom., 2006, 20, 19, 2823-2836, https://doi.org/10.1002/rcm.2665 . [all data]

Njoroge, Koaze, et al., 2005
Njoroge, S.M.; Koaze, H.; Karanja, P.N.; Sawamura, M., Volatile Constituents of Redblush Grapefruit ( Citrus paradisi) and Pummelo ( Citrus grandis) Peel Essential Oils from Kenya, J. Agric. Food Chem., 2005, 53, 25, 9790-9794, https://doi.org/10.1021/jf051373s . [all data]

Chyau, Mau, et al., 1996
Chyau, C.-C.; Mau, J.-L.; Wu, C.-M., Characteristics of the steam-distilled oil and carbon dioxide extract of Zanthoxylum simulans and fruits, J. Agric. Food Chem., 1996, 44, 4, 1096-1099, https://doi.org/10.1021/jf950577d . [all data]

Lazarevic, Radulovic, et al., 2010
Lazarevic, J.; Radulovic, N.; Palic, R.; Zlatkovic, B., Chemical Analusis of volatile constituents of Berula erecta (Hudson) Coville subsp. erecta (Apiaceae) from Serbia, J. Essential Oil. Res., 2010, 22, 3, 153-156, https://doi.org/10.1080/10412905.2010.9700290 . [all data]

Radulovic, Dordevic, et al., 2010
Radulovic, N.; Dordevic, N.; Markovic, M.; Palic, R., Volatile constituents of Glechoma Hirsuta Waldst. Kit. and G. Hederacea L. (Lamiaceae), Bull. Chem. Soc. Ethiop., 2010, 24, 1, 67-76, https://doi.org/10.4314/bcse.v24i1.52962 . [all data]

Bos, Woerdenbag, et al., 2007
Bos, R.; Woerdenbag, H.J.; Kayser, O.; Quax, W.J.; Ruslan, K.; Elfami, Essential oil constituents of Piper cubeba L. fils. from Indonesia, J. Essent. Oil Res., 2007, 19, 1, 14-17, https://doi.org/10.1080/10412905.2007.9699217 . [all data]

Elfami, Bos, et al., 2007
Elfami; Bos, R.; Ruslan, K.; Woerdenbag, H.J.; Kayser, P.; Quax, W.J., Essential Oil Constituents of Piper cubeba from Indonesia, 2007, 53-60. [all data]

Vagionas, Graikou, et al., 2007
Vagionas, K.; Graikou, K.; Ngassapa, O.; Runyoro, D.; Chinou, I., Composition and antimicrobial activity of the essential oils of three Satureja species growing in Tansania, Food Chem., 2007, 103, 2, 319-324, https://doi.org/10.1016/j.foodchem.2006.07.051 . [all data]

Elfami, Komar, et al., 2006
Elfami, R.B.; Komar, R.; Woerdenbag, H.J.; Kayser, P.; Quax, W.J., Essential oil constituents of Piper cubeba from Indonesia, 2006, retrieved from http://dissertations.ub.rug.nl/FILES/facultiew/science/2006/elfahmi/05c5.pdf. [all data]

Figuérédo, Cabassu, et al., 2006
Figuérédo, G.; Cabassu, P.; Chalchat, J.-C.; Pasquier, B., Studies of Mediterranean oregano populations. VIII. Chemical composition of essential oils of oreganos of various origins, Flavour Fragr. J., 2006, 21, 1, 134-139, https://doi.org/10.1002/ffj.1543 . [all data]

Bos, Stojanova, et al., 2005
Bos, R.; Stojanova, A.; Woerdenbag, H.J.; Koulman, A.; Quax, W.J., Volatile components of the aerial parts of Artemisia pontica L. grown in Bulgaria, Flavour Fragr. J., 2005, 20, 2, 145-148, https://doi.org/10.1002/ffj.1399 . [all data]

Duarte, Figueira, et al., 2005
Duarte, M.C.T.; Figueira, G.M.; Sartoratto, A.; Rehder, V.L.G.; Delarmelina, C., Anti-Candida activity of Brazilian medicinal plants, J. Ethnopharmacol., 2005, 97, 2, 305-311, https://doi.org/10.1016/j.jep.2004.11.016 . [all data]

Özel, Gögüs, et al., 2005
Özel, M.Z.; Gögüs, F.; Hamilton, J.F.; Lewis, A.C., Analysis of volatile components from Ziziphora taurica subsp. taurica by steam distillation, superheated-water extraction, and direct thermal desorption with GC×GC-TOFMS, Anal. Bioanal. Chem., 2005, 382, 1, 115-119, https://doi.org/10.1007/s00216-005-3156-x . [all data]

Rasooli and Owlia, 2005
Rasooli, I.; Owlia, P., Chemoprevention by thyme oils of Aspergillus parasiticus growth and aflatoxin production, Phytochemistry, 2005, 66, 24, 2851-2856, https://doi.org/10.1016/j.phytochem.2005.09.029 . [all data]

Kilic, Hafizoglu, et al., 2004
Kilic, A.; Hafizoglu, H.; Kollmannsberger, H.; Nitz, S., Volatile constituents and key odorants in leaves, buds, flowers, and fruits of Laurus nobilis L., J. Agric. Food Chem., 2004, 52, 6, 1601-1606, https://doi.org/10.1021/jf0306237 . [all data]

Rasooli and Razzaghi Abyaneh, 2004
Rasooli, I.; Razzaghi Abyaneh, M., Inhibitory effects of Thyme oils on growth and aflatoxin production by Aspergillus parasiticus, Food Control, 2004, 15, 6, 479-483, https://doi.org/10.1016/j.foodcont.2003.07.002 . [all data]

Ghannadi and Zolfaghari, 2003
Ghannadi, A.; Zolfaghari, B., Compositional analysis of the essential oil of Lallemantia royleana (Benth. in Wall.) Benth. from Iran, Flavour Fragr. J., 2003, 18, 3, 237-239, https://doi.org/10.1002/ffj.1215 . [all data]

Masotti, Juteau, et al., 2003
Masotti, V.; Juteau, F.; Bessière, J.M.; Viano, J., Seasonal and phenological variations of the essential oil from the narrow endemic species Artemisia molinieri and its biological activities, J. Agric. Food Chem., 2003, 51, 24, 7115-7121, https://doi.org/10.1021/jf034621y . [all data]

Perez-Alonso, Velasco-Negueruela, et al., 2003
Perez-Alonso, M.J.; Velasco-Negueruela, A.; Palá-Paúl, J.; Sanz, J., Variations in the essential oil composition of Artemisia pedemontana gathered in Spain: chemotype camphor-1,8-cineole and chemotype davanone, Biochem. Syst. Ecol., 2003, 31, 1, 77-84, https://doi.org/10.1016/S0305-1978(02)00082-0 . [all data]

Pino, Marbot, et al., 2003
Pino, J.A.; Marbot, R.; Fuentes, V., Characterization of volatiles in Bullock's heart (Annona reticulata L.) fruit cultivars from Cuba, J. Agric. Food Chem., 2003, 51, 13, 3836-3839, https://doi.org/10.1021/jf020733y . [all data]

Gallori, Flamini, et al., 2001
Gallori, S.; Flamini, G.; Bilia, A.R.; Morelli, I.; Landini, A.; Vincieri, F.F., Chemical composition of some traditional herbal drug preparations: essential oil and aromatic water of costmary (Balsamita suaveolens Pers.), J. Agric. Food Chem., 2001, 49, 12, 5907-5910, https://doi.org/10.1021/jf0107656 . [all data]

Doneanu and Anitescu, 1998
Doneanu, C.; Anitescu, G., Supercritical carbon dioxide extraction of Angelica archangelica L. root oil, J. Supercrit. Fluids, 1998, 12, 1, 59-67, https://doi.org/10.1016/S0896-8446(97)00040-5 . [all data]

Albano, Lima, et al., 2012
Albano, S.M.; Lima, A.S.; Miguel, M.G.; Pedro, L.G.; Barroso, J.G.; Figueiredo, A.C., Antioxidant, anti-5-lipoxygenase and antiacetylcholinesterase activities of essential oils and decoction water of some aromatic plants, Rec. Nat. Prod., 2012, 6, 1, 35-48. [all data]

Chu, Liu, et al., 2011
Chu, S.S.; Liu, S.L.; Liu, Q.Z.; Liu, Z.L.; Du, S.S., Composition and toxicity of Chinese Dracocephalum moldavica (Labiatae) essential oil against two grain storage insects, J. Med. Plants Res., 2011, 5, 21, 5262-5267. [all data]

Nezhadali and Parsa, 2010
Nezhadali, A.; Parsa, M., Study of the volatile compounds in Artemisia Sagebrush from Iran using HS/SPME/GC/MS, Int. J. Environ. Sci. Development, 2010, 1, 3, 287-289, https://doi.org/10.7763/IJESD.2010.V1.56 . [all data]

Costa, De Fina, et al., 2008
Costa, R.; De Fina, M.R.; Valentino, M.R.; Rustaiyan, A.; Dugo, P.; Dugo, G.; Mondello, L., An investigation on the volatile composition of some Artemisia species from Iran, Flavour Fragr. J., 2008, 24, 2, 75-82, https://doi.org/10.1002/ffj.1919 . [all data]

Chen, Chyau, et al., 2007
Chen, C.-C.; Chyau, C.-C.; Hseu, TY.-H., Production of a COX-2 inhibitor, 2,4,5-trimethoxybenzaldehyde, with submerged cultured Antrodia camphorata, Lett. Appl. Microbiol., 2007, 44, 4, 387-392, https://doi.org/10.1111/j.1472-765X.2006.02087.x . [all data]

Hachicha, Skanji, et al., 2007
Hachicha, S.F.; Skanji, T.; Barrek, S.; Ghrabi, Z.G.; Zarrouk, H., Composition of the essential oil of Teucrium ramosissimum Desf. (Lamiaceae) from Tunisia, Flavour Fragr. J., 2007, 22, 2, 101-104, https://doi.org/10.1002/ffj.1764 . [all data]

Njoroge, Koaze, et al., 2005, 2
Njoroge, S.M.; Koaze, H.; Karanja, P.N.; Sawamura, M., Essential oil constituents of three varieties of Kenyan sweet oranges (Citrus sinensis), Flavour Fragr. J., 2005, 20, 1, 80-85, https://doi.org/10.1002/ffj.1377 . [all data]

Suleimenov, Atazharova, et al., 2003
Suleimenov, E.M.; Atazharova, G.A.; Demirchi, B.; Baser, K.H.C.; Adekenov, S.M., Essential oil composition of Artemisia Lercheana and A. Sieversiana of Kazakhstan flora in Recent problems of development of new medicines of natural origin, Proceedings of symposium, St.Petersburg - Pushkin, 2003, 382-385. [all data]

Noorizadeh and Farmany, 2010
Noorizadeh, H.; Farmany, A., Exploration of linear and nonlinear modeling techniques to predict of retention index of essential oils, J. Chin. Chem. Soc., 2010, 1268-1277. [all data]

Polatoglu, Demirci, et al., 2010
Polatoglu, K.; Demirci, F.; Demirci, B.; Goren, N.; Baser, K.H.C., Antimicrobial activity and essential oil composition of a new T. argyrophyllum (C. Koch) Tvzel var. argyrophyllium chemotype, J. Oleo Sci., 2010, 59, 6, 307-313, https://doi.org/10.5650/jos.59.307 . [all data]

Baser, Demirci, et al., 2009
Baser, K.H.C.; Demirci, B.; Kurkcuoglu, M.; Satin, F.; Tumen, G., Comparative morphological and phytochemical charactertization of Salvia cadmica and S. smyrnaea, Pak. J. Bot., 2009, 41, 4, 1545-1555. [all data]

Tabanca N., Demirci B., et al., 2007
Tabanca N.; Demirci B.; Crockett S.L.; Baser K.H.C.; Wedge D.E., Chemical composition and antifungal activity of Arnica longifolia, Aster hesperius, and Chrysothamnus nauseosus essential oils, J. Agric. Food Chem., 2007, 55, 21, 8430-8435, https://doi.org/10.1021/jf071379c . [all data]

Kürkçüoglu, Hüsnü Can Baser, et al., 2006
Kürkçüoglu, M.; Hüsnü Can Baser, K.; Iscan, G.; Malyer, H.; Kaynak, G., Composition and anticandidal activity of the essential oil of Chaerophyllum byzantinum Boiss., Flavour Fragr. J., 2006, 21, 1, 115-117, https://doi.org/10.1002/ffj.1539 . [all data]

Suleimenov Y.M., Atazhanova G.A., et al., 2006
Suleimenov Y.M.; Atazhanova G.A.; Ozek T.; Demirci B.; Kulyyasov A.T.; Adekenov S.M.; Baser K.H.C., Essential oil composition of three species of Achillea from Kazakhstan, Chem. Nat. Compd. (Engl. Transl.), 2006, 37, 5, 447-450, https://doi.org/10.1023/A:1014471326724 . [all data]

Tabanca, Demirci, et al., 2006
Tabanca, N.; Demirci, B.; Ozek, T.; Kirimer, N.; Can Baser, K.H.; Bedir, E.; Khan, I.A.; Wedge, D.E., Gas chromatographic-mass spectrometric analysis of essential oils from Pimpinella species gathered from Central and Northern Turkey, J. Chromatogr. A, 2006, 1117, 2, 194-205, https://doi.org/10.1016/j.chroma.2006.03.075 . [all data]

Demirci, Demirci, et al., 2005
Demirci, B.; Demirci, F.; Baser, K.H.C., Headspace-SPME and hydrodistillation of two fragrant Artemisia sp., Flavour Fragr. J., 2005, 20, 4, 395-398, https://doi.org/10.1002/ffj.1426 . [all data]

Baser, Demirci, et al., 2003
Baser, K.H.C.; Demirci, B.; Dekebo, A.; Dagne, E., Essential oils of some Boswellia spp., myrrh and opopanax, Flavour Fragr. J., 2003, 18, 2, 153-156, https://doi.org/10.1002/ffj.1166 . [all data]

Viljoen, van Vuuren, et al., 2003
Viljoen, A.; van Vuuren, S.; Ernst, E.; Klepser, M.; Demirci, B.; Baser, H.; van Wyk, B.-E., Osmitopsis asteriscoides (Asteraceae)-the antimicrobial activity and essential oil composition of a Cape-Dutch remedy, J. Ethnopharmacol., 2003, 88, 2-3, 137-143, https://doi.org/10.1016/S0378-8741(03)00191-0 . [all data]

Hüsnü Can Baser, Demirci, et al., 2002
Hüsnü Can Baser, K.; Demirci, B.; Femirci, F.; Kocak, S.; Akinci, C.; Malyer, H.; Güleryüz, G., Composition and antimicrobial activity of the essential oil of Achellea multifida, Planta Medica, 2002, 68, 10, 941-943, https://doi.org/10.1055/s-2002-34923 . [all data]

Tunalier, Kirimer, et al., 2002
Tunalier, Z.; Kirimer, N.; Baser, K.H.C., The composition of essential oils from various parts of Juniperus foetidissima, Chem. Nat. Compd. (Engl. Transl.), 2002, 38, 1, 43-47, https://doi.org/10.1023/A:1015725630556 . [all data]

Baser, Demirci, et al., 2001
Baser, K.H.C.; Demirci, B.; Tabanca, N.; Özek, T.; Gören, N., Composition of the essential oils of Tanacetum armenum (DC.) Schultz Bip., T. balsamita L., T. chiliophyllum (Fisch. Mey.) Schultz Bip. var. chiliophyllum and T. haradjani (Rech. fil.) Grierson and the enantiomeric distribution of camphor and carvone, Flavour Fragr. J., 2001, 16, 3, 195-200, https://doi.org/10.1002/ffj.977 . [all data]

Gören, Demirci, et al., 2001
Gören, N.; Demirci, B.; Baser, K.H.C., Composition of the essential oils of Tanacetum spp. from Turkey, Flavour Fragr. J., 2001, 16, 3, 191-194, https://doi.org/10.1002/ffj.976 . [all data]

Özcan, Akgül, et al., 2001
Özcan, M.; Akgül, A.; Bascr, K.H.C.; Özck, T.; Tabanca, N., Essential oil composition of sea fennel (Crithmum maritimum) form Turkey, Nahrung/Food, 2001, 45, 5, 353-356, https://doi.org/10.1002/1521-3803(20011001)45:5<353::AID-FOOD353>3.0.CO;2-4 . [all data]

Baser, Tabanca, et al., 2000
Baser, K.H.C.; Tabanca, N.; Özek, T.; Demirci, B.; Duran, A.; Duman, H., Composition of the essential oil of Chaerophyllum aksekiense A. Duran et Duman, a recently described endemic from Turkey, Flavour Fragr. J., 2000, 15, 1, 43-44, https://doi.org/10.1002/(SICI)1099-1026(200001/02)15:1<43::AID-FFJ864>3.0.CO;2-# . [all data]