10H-Phenothiazine,10-[4-(diethylamino)-1-oxobutyl]-

Gas phase ion energetics data

Data compiled by: Sharon G. Lias, Rhoda D. Levin, and Sherif A. Kafafi

Ionization energy determinations

IE (eV) Method Reference
7.88 ± 0.07CTSPoltorakov, Pirnazarova, et al., 1973

References

Poltorakov, Pirnazarova, et al., 1973
Poltorakov, A.P.; Pirnazarova, F.N.; But, P.G.; Piruzyan, L.A.; Chibrikin, V.M.; Vikjlyaev, Yu.I.; Ul'yanova, O.V., Ionization potentials of phenothiazine derivatives and their correlation with the parmacologic effect, Bull. Acad. Sci. USSR, Div. Chem. Sci., 1973, 22, 2050, In original 2106. [all data]