Heptadecanoic acid, 16-methyl-, methyl ester

Normal alkane RI, non-polar column, temperature ramp

Data compiled by: NIST Mass Spectrometry Data Center, William E. Wallace, director

Column type Capillary
Active phase OV-101
Column length (m) 45.
Carrier gas He
Substrate
Column diameter (mm) 0.25
Phase thickness (μm)
Tstart (C) 100.
Tend (C) 180.
Heat rate (K/min) 3.
Initial hold (min)
Final hold (min)
I 2103.
ReferenceWu, Zhao, et al., 1987
Comment MSDC-RI

References

Wu, Zhao, et al., 1987
Wu, C.; Zhao, D.; Sun, S.; Ma, Y.; Wang, Q.; Lu, S., The minor chemical components of the absolute oil from the flower, Acta botanica Sinica, 1987, 29, 6, 636-642. [all data]