Butanoic acid, 2-ethyl-, butyl ester

Kovats' RI, non-polar column, isothermal

Data compiled by: NIST Mass Spectrometry Data Center, William E. Wallace, director

Column type Packed
Active phase SE-30
Column length (m) 3.7
Carrier gas
Substrate Celaton (62-72 mesh)
Column diameter (mm)
Phase thickness (μm)
Temperature (C) 150.
I 1093.
ReferenceAshes and Haken, 1974
Comment MSDC-RI

References

Ashes and Haken, 1974
Ashes, J.R.; Haken, J.K., Gas chromatography of homologous esters. VI. Structure-retention increments of aliphatic esters, J. Chromatogr., 1974, 101, 1, 103-123, https://doi.org/10.1016/S0021-9673(01)94737-5 . [all data]