Ascaridole

Phase change data

Data compiled by: Robert L. Brown and Stephen E. Stein

Quantity Value Units Method Reference Comment
Tfus276.4KN/ABuckingham and Donaghy, 1982

Reduced pressure boiling point

Tboil (K) Pressure (bar) Reference
388.20.020Weast and Grasselli, 1989
312.20.0003Weast and Grasselli, 1989
388.0.020Buckingham and Donaghy, 1982
312. - 313.0.0003Buckingham and Donaghy, 1982

Gas phase ion energetics data

Data compiled by: Sharon G. Lias, Rhoda D. Levin, and Sherif A. Kafafi

Ionization energy determinations

IE (eV) Method Reference Comment
8.07PEBrown, 1975
8.42PEBrown, 1976Vertical value

References

Buckingham and Donaghy, 1982
Buckingham, J.; Donaghy, S.M., Dictionary of Organic Compounds: Fifth Edition, Chapman and Hall, New York, 1982, 1. [all data]

Weast and Grasselli, 1989
CRC Handbook of Data on Organic Compounds, 2nd Editon, Weast,R.C and Grasselli, J.G., ed(s)., CRC Press, Inc., Boca Raton, FL, 1989, 1. [all data]