1,7-Octadiene-3,6-diol, 2,6-dimethyl-

Van Den Dool and Kratz RI, non-polar column, temperature ramp

Data compiled by: NIST Mass Spectrometry Data Center, William E. Wallace, director

Column type Capillary
Active phase DB-5MS
Column length (m) 30.
Carrier gas H2
Substrate
Column diameter (mm) 0.25
Phase thickness (μm) 0.25
Tstart (C) 40.
Tend (C) 200.
Heat rate (K/min) 2.
Initial hold (min)
Final hold (min)
I 1270.
ReferenceChassagne, Boulanger, et al., 1999
Comment MSDC-RI

References

Chassagne, Boulanger, et al., 1999
Chassagne, D.; Boulanger, R.; Crouzet, J., Enzymatic hydrolysis of edible Passiflora fruit glycosides, Food Chem., 1999, 66, 3, 281-288, https://doi.org/10.1016/S0308-8146(99)00044-8 . [all data]