4,4'-methylenedicyclohexyl diisocyanate

Condensed phase thermochemistry data

Data compiled by: Hussein Y. Afeefy, Joel F. Liebman, and Stephen E. Stein

Quantity Value Units Method Reference Comment
Δfsolid-105.3 ± 0.8kcal/molCcbZhuravlev, Selivanov, et al., 1975
Quantity Value Units Method Reference Comment
Δcsolid-2057.0 ± 0.8kcal/molCcbZhuravlev, Selivanov, et al., 1975

References

Zhuravlev, Selivanov, et al., 1975
Zhuravlev, E.Z.; Selivanov, V.D.; Mulyanov, P.V.; Konstantinov, I.I., Physicochemical properties of 4,4'-dicyclohexylmethane diisocyanate, J. Appl. Chem. USSR, 1975, 1137-1139. [all data]