Rhodium, η4-1,3-butadiene-η5-cyclopentadienyl-

Gas phase ion energetics data

Data compiled by: Sharon G. Lias, John E. Bartmess, Joel F. Liebman, John L. Holmes, Rhoda D. Levin, and W. Gary Mallard

Ionization energy determinations

IE (eV) Method Reference Comment
6.75PEGreen, Powell, et al., 1984
7.26PEGreen, Powell, et al., 1984Vertical value

References

Green, Powell, et al., 1984
Green, J.C.; Powell, P.; van Tilborg, J.E., He I and He II photoelectron spectroscopic studies of the bonding in cobalt, rhodium, and iridium cyclopentadienyl diene complexes, Organometallics, 1984, 3, 211. [all data]