Molybdenum,bis(η5-2,4-cyclopentadien-1-yl)[3-methoxy-1-(methoxycarbonyl)-3-oxo-1-propenyl](trimethylstannyl)-

Gas phase ion energetics data

Data compiled by: Sharon G. Lias, Rhoda D. Levin, and Sherif A. Kafafi

Ionization energy determinations

IE (eV) Method Reference
6.80 ± 0.13EIHarris and Spalding, 1980

Appearance energy determinations

Ion AE (eV) Other Products MethodReferenceComment
C3H9Sn+9.44 ± 0.13?EIHarris and Spalding, 1980

References

Harris and Spalding, 1980
Harris, D.H.; Spalding, T.R., Electron impact study of compounds with main group IV element to transition metal bonds, Inorg. Chim. Acta, 1980, 39, 187. [all data]