CAS Reg. No. 51222-94-7

Reaction thermochemistry data

Data compiled by: John E. Bartmess

Individual Reactions

(CAS Reg. No. 51222-94-7 • 4294967295Carbon monoxide) + Carbon monoxide = CAS Reg. No. 51222-94-7

By formula: (CAS Reg. No. 51222-94-7 • 4294967295CO) + CO = CAS Reg. No. 51222-94-7

Quantity Value Units Method Reference Comment
Δr39.1 ± 2.8kcal/molN/AStevens, Feigerle, et al., 1982gas phase
Δr38.5 ± 2.3kcal/molCIDTSunderlin, Wang, et al., 1992gas phase; Affinity: CO..Ni(CO)2-

References

Stevens, Feigerle, et al., 1982
Stevens, A.E.; Feigerle, C.S.; Lineberger, W.C., Laser Photoelectron Spectrometry of Ni(CO)n-, n=1-3, J. Am. Chem. Soc., 1982, 104, 19, 5026, https://doi.org/10.1021/ja00383a004 . [all data]

Sunderlin, Wang, et al., 1992
Sunderlin, L.S.; Wang, D.; Squires, R.R., Metal Carbonyl Bond Strengths in Fe(CO)n- and Ni(CO)n-, J. Am. Chem. Soc., 1992, 114, 8, 2788, https://doi.org/10.1021/ja00034a004 . [all data]