α-Fenchol

Normal alkane RI, non-polar column, isothermal

Data compiled by: NIST Mass Spectrometry Data Center, William E. Wallace, director

Column type Capillary
Active phase DB-5
Column length (m)
Carrier gas
Substrate
Column diameter (mm)
Phase thickness (μm)
Temperature (C) 25.
I 1112.
ReferenceHemmateenejad, Jawadnia, et al., 2007
Comment MSDC-RI

Normal alkane RI, non-polar column, temperature ramp

Data compiled by: NIST Mass Spectrometry Data Center, William E. Wallace, director

Column type CapillaryCapillaryCapillaryCapillaryCapillary
Active phase CP-Sil 5 CBHP-5DB-5HP-5 MSSPB-1
Column length (m) 30.30.30.30.30.
Carrier gas NitrogenHydrogenHeliumHeliumHelium
Substrate
Column diameter (mm) 0.250.250.250.250.20
Phase thickness (μm) 0.260.250.250.250.20
Tstart (C) 45.70.50.60.70.
Tend (C) 280.290.250.280.220.
Heat rate (K/min) 3.5.5.3.3.
Initial hold (min)   2.
Final hold (min) 22.   15.
I 1103.1120.1117.1115.1098.
ReferenceMothana, Hasson, et al., 2011Radulovic, Dordevic, et al., 2010Ho, Wang, et al., 2009Tsokou, Georgopoulos, et al., 2007Cavaleiro, Pinto, et al., 2006
Comment MSDC-RI MSDC-RI MSDC-RI MSDC-RI MSDC-RI
Column type CapillaryCapillaryCapillaryCapillaryCapillary
Active phase CP-Sil 5 CBCP Sil 5 CBDB-1RSL-200DB-5
Column length (m) 25.25.50.30.30.
Carrier gas Hydrogen  H2H2
Substrate
Column diameter (mm) 0.250.250.250.320.25
Phase thickness (μm) 0.150.150.250.250.25
Tstart (C) 50.50.60.40.60.
Tend (C) 230.230.240.280.280.
Heat rate (K/min) 3.3.3.6.4.
Initial hold (min)    5.10.
Final hold (min)    5.40.
I 1102.1098.1088.1100.1112.
ReferenceOlawore, Usman, et al., 2006Ogunwande, Olawore, et al., 2005Velasco-Negueruela, Pérez-Alonso, et al., 2005Jirovetz, Buchbauer, et al., 2003Pino, Marbot, et al., 2003
Comment MSDC-RI MSDC-RI MSDC-RI MSDC-RI MSDC-RI
Column type CapillaryCapillaryCapillaryCapillaryCapillary
Active phase CP Sil 5 CBCP Sil 5 CBOV-101Methyl SiliconeSE-30+Igepal
Column length (m) 25.25.25.25.100.
Carrier gas  HeNitrogen
Substrate
Column diameter (mm) 0.250.250.200.500.25
Phase thickness (μm) 0.15
Tstart (C) 50.50.60.60.70.
Tend (C) 230.230.220.220.170.
Heat rate (K/min) 3.3.4.5.1.
Initial hold (min)   0.
Final hold (min)   0.
I 1120.1095.1100.1102.1110.
ReferenceAsekun and Ekundayo, 2000Oyedeji, Olawore, et al., 1999Tropnikova, Zenkevich, et al., 1999Mallavarapu, Ramesh, et al., 1993Shibamoto and Jennings, 1977
Comment MSDC-RI MSDC-RI MSDC-RI MSDC-RI MSDC-RI
Column type Capillary
Active phase SE-30+Igepal
Column length (m) 100.
Carrier gas
Substrate
Column diameter (mm) 0.25
Phase thickness (μm)
Tstart (C) 70.
Tend (C) 170.
Heat rate (K/min) 1.
Initial hold (min)
Final hold (min)
I 1112.
ReferenceShibamoto and Jennings, 1977
Comment MSDC-RI

Normal alkane RI, non-polar column, custom temperature program

Data compiled by: NIST Mass Spectrometry Data Center, William E. Wallace, director

Column type CapillaryCapillaryCapillaryCapillaryCapillary
Active phase 5 % Phenyl polydimethyl siloxaneHP-5HP-5MSBPX-5SE-30
Column length (m)  30.30.30.
Carrier gas  HeliumHeHe
Substrate
Column diameter (mm)  0.250.250.25
Phase thickness (μm)  0.250.250.25
Program not specified60 0C (1 min) 10 0C/min -> 180 0C (1 min) 20 0C/min -> 280 0C (15 min)40C(10min) => 3C/min => 200C => 2C/min => 220C50C => 3C/min => 150C(10min) => 10C/min => 250Cnot specified
I 1116.1104.1112.1128.1101.
ReferenceChaverri, Diaz, et al., 2011Wang, Liu, et al., 2011Cole, Haber, et al., 2007Salamci, Kordali, et al., 2007Vinogradov, 2004
Comment MSDC-RI MSDC-RI MSDC-RI MSDC-RI MSDC-RI
Column type CapillaryCapillaryCapillaryCapillary
Active phase SE-30DB-1DB-1Polydimethyl siloxanes
Column length (m)  30.30.
Carrier gas  H2He
Substrate
Column diameter (mm)  0.250.25
Phase thickness (μm)  0.250.25
Program not specified40 0C 3 K/min -> 175 0C 15 K/min -> 240 0C (10 min)45C => 3C/min => 175C => 15C/min => 240C (10min)not specified
I 1110.1088.1088.1101.
ReferenceVinogradov, 2004da Silva, Pedro, et al., 2000Baratta, Dorman, et al., 1998Zenkevich, 1997
Comment MSDC-RI MSDC-RI MSDC-RI MSDC-RI

Normal alkane RI, polar column, temperature ramp

Data compiled by: NIST Mass Spectrometry Data Center, William E. Wallace, director

Column type CapillaryCapillaryCapillary
Active phase Supelcowax 10Carbowax 20MCarbowax 20M
Column length (m) 30.100.100.
Carrier gas Helium
Substrate
Column diameter (mm) 0.200.250.25
Phase thickness (μm) 0.20
Tstart (C) 70.70.70.
Tend (C) 220.170.170.
Heat rate (K/min) 3.1.1.
Initial hold (min)
Final hold (min) 15.
I 1581.1574.1578.
ReferenceCavaleiro, Pinto, et al., 2006Shibamoto and Jennings, 1977Shibamoto and Jennings, 1977
Comment MSDC-RI MSDC-RI MSDC-RI

Van Den Dool and Kratz RI, polar column, custom temperature program

Data compiled by: NIST Mass Spectrometry Data Center, William E. Wallace, director

Column type Capillary
Active phase BP-20
Column length (m)
Carrier gas
Substrate
Column diameter (mm)
Phase thickness (μm)
Program not specified
I 1573.
ReferenceFilippini, Tomi, et al., 2000
Comment MSDC-RI

Kovats' RI, non-polar column, isothermal

Data compiled by: NIST Mass Spectrometry Data Center, William E. Wallace, director

Column type Capillary
Active phase SE-30
Column length (m) 40.
Carrier gas
Substrate
Column diameter (mm) 0.35
Phase thickness (μm) 0.35
Temperature (C) 100.
I 1111.9
ReferenceTudor, 1997
Comment MSDC-RI

References

Hemmateenejad, Jawadnia, et al., 2007
Hemmateenejad, B.; Jawadnia, K.; Elyasi, M., Quantitative structure - retention relationship for the Kovats retention indices of a large set of terpenes: a comdined data splitting-feature selection strategy, Anal. Chim. Acta, 2007, 592, 1, 72-81, https://doi.org/10.1016/j.aca.2007.04.009 . [all data]