Cycloheptane, cycloheptylidene-

Reaction thermochemistry data

Data compiled by: Hussein Y. Afeefy, Joel F. Liebman, and Stephen E. Stein

Individual Reactions

6Hydrogen + 1,3,5-Cycloheptatriene-7-(2,4,6-cycloheptatrien-1-ylidene)- = Cycloheptane, cycloheptylidene-

By formula: 6H2 + C14H12 = C14H24

Quantity Value Units Method Reference Comment
Δr-130.77 ± 0.13kcal/molChydTurner, Meador, et al., 1957solid phase; solvent: Diethylcarbitol

References

Turner, Meador, et al., 1957
Turner, R.B.; Meador, W.R.; Doering, W.E.; Knox, L.H.; Mayer, J.R.; Wiley, D.W., Heats of hydrogenation. III. Hydrogenation of cycllooctatetraene and of some seven-membered non-benzenoid aromatic compounds, J. Am. Chem. Soc., 1957, 79, 4127-4133. [all data]