Bicyclo[2.2.1]heptane, 2-methyl-3-methylene-2-(4-methyl-3-pentenyl)-, (1S-exo)-

Van Den Dool and Kratz RI, polar column, temperature ramp

Data compiled by: NIST Mass Spectrometry Data Center, William E. Wallace, director

Column type CapillaryCapillaryCapillary
Active phase HP-WaxRTX-WaxSupelcowax
Column length (m) 30.30.30.
Carrier gas N2HeHe
Substrate
Column diameter (mm) 0.250.250.25
Phase thickness (μm) 0.250.250.25
Tstart (C) 60.45.40.
Tend (C) 220.240.240.
Heat rate (K/min) 5.3.2.
Initial hold (min) 10.6.
Final hold (min)  10.10.
I 1648.1620.1655.
ReferenceFlamini, Tebano, et al., 2006Dugo, Mondello, et al., 2004Bassole, Ouattara, et al., 2003
Comment MSDC-RI MSDC-RI MSDC-RI

References

Flamini, Tebano, et al., 2006
Flamini, G.; Tebano, M.; Cioni, P.L.; Bagci, Y.; Dural, H.; Ertugrul, K.; Uysal, T.; Savran, A., A multivariate statistical approach to Centaurea classification using essential oil composition data of some species from Turkey, Pl. Syst. Evol., 2006, 261, 1-4, 217-228, https://doi.org/10.1007/s00606-006-0448-3 . [all data]

Dugo, Mondello, et al., 2004
Dugo, P.; Mondello, L.; Zappia, G.; Bonaccorsi, I.; Cotroneo, A.; Russo, M.T., The composition of the volatile fraction and the enantiomeric distribution of five volatile components of faustrime oil (Monocitrus australatica x Fortunella sp. x Citrus aurantifolia), J. Essent. Oil Res., 2004, 16, 4, 328-333, https://doi.org/10.1080/10412905.2004.9698734 . [all data]

Bassole, Ouattara, et al., 2003
Bassole, I.H.N.; Ouattara, A.S.; Nebie, R.; Ouattara, C.A.T.; Kabore, Z.I.; Traore, S.A., Chemical composition and antibacterial activities of the essential oils of Lippia chevalieri and Lippia multiflora from Burkina Faso, Phytochemistry, 2003, 62, 2, 209-212, https://doi.org/10.1016/S0031-9422(02)00477-6 . [all data]